{"text_format":"1","workbook":"xlsx","n_sheets":3,"sheets":["o igri","pojmovi","igra"],"not_rendered":{"charts":0,"images":2,"macros":1,"external_links":0,"defined_names":1,"comments":1,"pivot_tables":0},"unopened":[],"bounds":{"document_bytes":16777216,"sheet_cells":100000,"rows_first":2000,"rows_last":500,"rows_between":2000,"halvings":0,"cell_chars":16384,"cell_head_chars":4096},"cells_cut":0,"cells_raw":0,"read":"whole","date_system":"1900"}

{"sheet":"o igri","index":0,"n_rows":28,"n_cols":11,"rows_kept":28,"cut":false,"hidden":false,"merged":[]}
[]
[null,"IGRA"]
[null,"Pogađalica"]
[null,null,null,null,null,null,null,null,null,null,"6.12.2018."]
[]
[null,"Priprema:"]
[null,"Na kartici (listi) \"pojmovi\" upisujete pojmove ili izjave koje će se u igri tražiti."]
[null,"Jedan pojam ili izjava ne smije imati više od 70 znakova (s prazninama). Možete koristiti i brojeve i interpunkcijske znakove."]
[null,"Gumbom \"Očisti tabelu!\" možete izbrisati sve upisane izjave. Nakon toga upisujete svoje pojmove i izjave."]
[null,"Kod spremanja pripremljene igre (Spremi), izaberite oblik excel datoteke \"s omogućenim makronaredbama\" (.xlsm)."]
[]
[null,"Igra:"]
[null,"Na kartici \"igra\" iza riječi \"tražimo\" upisujete (odabirete) broj izjave (iz tabele \"pojmovi\"), nakon čega pritisnete ENTER."]
[null,"U kvadratićima niže (\"otkrivamo slova\") upisujete slova koja se pogađaju. (Predlažem da uključite CAPS LOCK.)"]
[null,"Svako slovo (ili broj) se upisuje u svoju ćeliju! (Dvoslovi \"LJ\", \"NJ\" i \"DŽ\" se također pišu u jedan kvadratić!)"]
[null,"Nakon upisa slova i pritiska na ENTER, ukoliko tog slova ima u izjavi, u okviru za IZJAVE pojavit će se to slovo na svim svojim mjestima."]
[null,"Nakon \"pogođenog\" slova, može se pogađati \"konačno rješenje\", tj. cijela izjava (traženi pojam)."]
[null,"Kad se pogode sva slova (brojke) koja su potrebna za cijelu izjavu, IZJAVA će pozelenjeti."]
[]
[null,"Cilj igre:"]
[null,"Sa što manje pokušaja pogađanja slova treba otkriti traženi pojam ili izjavu."]
[]
[]
[]
[null,null,null,null,null,null,null,null,"Autor igre:"]
[null,null,null,null,null,null,null,null,"Krešimir Hublin"]
[null,null,null,null,null,null,null,null,"kresimir.hublin@skole.hr"]
[null,null,null,null,null,null,null,null,"www.informatika.hublin.net"]

{"sheet":"pojmovi","index":1,"n_rows":31,"n_cols":74,"rows_kept":31,"cut":false,"hidden":false,"merged":[]}
["r. br.","Zagonetni pojmovi i izjave: (Do 70 znakova s prazninama!)","znakova:",null,"izjava po slovima:"]
[1,"Ruđer Bošković",{"$f":"IF(LEN(B2)<71, LEN(B2),\"Previše!\")","v":14},1,{"$f":"IF(OR(LEFT(B2, 2) =\"NJ\", LEFT(B2, 2) =\"LJ\", LEFT(B2, 2) =\"DŽ\"), LEFT(B2, 2), LEFT(B2, 1))","v":"R"},{"$f":"IF(OR(MID($B$2, E$3+1,2) =\"NJ\", MID($B$2, E$3+1,2) =\"LJ\", MID($B$2, E$3+1,2) =\"DŽ\"), MID($B$2, E$3+1,2),MID($B$2, E$3+1,1))","v":"u"},{"$f":"IF(OR(MID($B$2, F$3+1,2) =\"NJ\", MID($B$2, F$3+1,2) =\"LJ\", MID($B$2, F$3+1,2) =\"DŽ\"), MID($B$2, F$3+1,2),MID($B$2, F$3+1,1))","v":"đ"},"e","r"," ","B","o","š","k","o","v","i","ć","","","","","","","","","","","","","","","","","","","","","","","","","","","","","","","","","","","","","","","","","","","","","","","","","","","","",{"$f":"IF(OR(MID($B$2, BR$3+1,2) =\"NJ\", MID($B$2, BR$3+1,2) =\"LJ\", MID($B$2, BR$3+1,2) =\"DŽ\"), MID($B$2, BR$3+1,2),MID($B$2, BR$3+1,1))","v":""},"","",""]
[null,null,null,null,{"$f":"IF(OR(LEFT(B2, 2) =\"NJ\", LEFT(B2, 2) =\"LJ\", LEFT(B2, 2) =\"DŽ\"),2,1)","v":1},{"$f":"IF(OR(MID($B$2,E$3+1,2)=\"NJ\",MID($B$2,E$3+1,2)=\"LJ\",MID($B$2,E$3+1,2)=\"DŽ\"),E$3+2,E$3+1)","v":2},3,4,5,6,{"$f":"IF(OR(MID($B$2,J$3+1,2)=\"NJ\",MID($B$2,J$3+1,2)=\"LJ\",MID($B$2,J$3+1,2)=\"DŽ\"),J$3+2,J$3+1)","v":7},{"$f":"IF(OR(MID($B$2,K$3+1,2)=\"NJ\",MID($B$2,K$3+1,2)=\"LJ\",MID($B$2,K$3+1,2)=\"DŽ\"),K$3+2,K$3+1)","v":8},9,10,11,12,13,14,15,16,17,18,19,20,21,22,23,24,25,26,27,28,29,30,31,32,33,34,35,36,37,38,39,40,41,42,43,44,45,46,47,48,49,50,51,52,53,54,55,56,57,58,59,60,61,62,63,64,65,66,67,68,69,70]
[2,"U radu je spas.",{"$f":"IF(LEN(B4)<71, LEN(B4),\"Previše!\")","v":15},2,{"$f":"IF(OR(LEFT(B4, 2) =\"NJ\", LEFT(B4, 2) =\"LJ\", LEFT(B4, 2) =\"DŽ\"), LEFT(B4, 2), LEFT(B4, 1))","v":"U"},{"$f":"IF(OR(MID($B4, E5+1,2) =\"NJ\", MID($B4, E5+1,2) =\"LJ\", MID($B4, E5+1,2) =\"DŽ\"), MID($B4, E5+1,2),MID($B4, E5+1,1))","v":" "},{"$f":"IF(OR(MID($B4, F5+1,2) =\"NJ\", MID($B4, F5+1,2) =\"LJ\", MID($B4, F5+1,2) =\"DŽ\"), MID($B4, F5+1,2),MID($B4, F5+1,1))","v":"r"},"a","d","u"," ","j","e"," ","s","p","a","s",".","","","","","","","","","","","","","","","","","","","","","","","","","","","","","","","","","","","","","","","","","","","","","","","","","","","",{"$f":"IF(OR(MID($B4, BR5+1,2) =\"NJ\", MID($B4, BR5+1,2) =\"LJ\", MID($B4, BR5+1,2) =\"DŽ\"), MID($B4, BR5+1,2),MID($B4, BR5+1,1))","v":""},"","",""]
[null,null,null,null,{"$f":"IF(OR(LEFT(B4, 2) =\"NJ\", LEFT(B4, 2) =\"LJ\", LEFT(B4, 2) =\"DŽ\"),2,1)","v":1},{"$f":"IF(OR(MID($B4, E5+1,2)=\"NJ\",MID($B4, E5+1,2)=\"LJ\",MID($B4, E5+1,2)=\"DŽ\"),E5+2,E5+1)","v":2},{"$f":"IF(OR(MID($B4, F5+1,2)=\"NJ\",MID($B4, F5+1,2)=\"LJ\",MID($B4, F5+1,2)=\"DŽ\"),F5+2,F5+1)","v":3},4,5,6,7,8,9,10,11,12,13,14,15,16,17,18,19,20,21,22,23,24,25,26,27,28,29,30,31,32,33,34,35,36,37,38,39,40,41,42,43,44,45,46,47,48,49,50,51,52,53,54,55,56,57,58,59,60,61,62,63,64,65,66,{"$f":"IF(OR(MID($B4, BR5+1,2)=\"NJ\",MID($B4, BR5+1,2)=\"LJ\",MID($B4, BR5+1,2)=\"DŽ\"),BR5+2,BR5+1)","v":67},68,69,70]
[3,"Sada je 2018. godina.",21,3,{"$f":"IF(OR(LEFT(B6, 2) =\"NJ\", LEFT(B6, 2) =\"LJ\", LEFT(B6, 2) =\"DŽ\"), LEFT(B6, 2), LEFT(B6, 1))","v":"S"},{"$f":"IF(OR(MID($B6, E7+1,2) =\"NJ\", MID($B6, E7+1,2) =\"LJ\", MID($B6, E7+1,2) =\"DŽ\"), MID($B6, E7+1,2),MID($B6, E7+1,1))","v":"a"},"d","a"," ","j","e"," ","2","0","1","8","."," ","g","o","d","i","n","a",".","","","","","","","","","","","","","","","","","","","","","","","","","","","","","","","","","","","","","","","","","","","","","","","","",""]
[null,null,null,null,{"$f":"IF(OR(LEFT(B6, 2) =\"NJ\", LEFT(B6, 2) =\"LJ\", LEFT(B6, 2) =\"DŽ\"),2,1)","v":1},{"$f":"IF(OR(MID($B6, E7+1,2)=\"NJ\",MID($B6, E7+1,2)=\"LJ\",MID($B6, E7+1,2)=\"DŽ\"),E7+2,E7+1)","v":2},{"$f":"IF(OR(MID($B6, F7+1,2)=\"NJ\",MID($B6, F7+1,2)=\"LJ\",MID($B6, F7+1,2)=\"DŽ\"),F7+2,F7+1)","v":3},{"$f":"IF(OR(MID($B6, G7+1,2)=\"NJ\",MID($B6, G7+1,2)=\"LJ\",MID($B6, G7+1,2)=\"DŽ\"),G7+2,G7+1)","v":4},{"$f":"IF(OR(MID($B6, H7+1,2)=\"NJ\",MID($B6, H7+1,2)=\"LJ\",MID($B6, H7+1,2)=\"DŽ\"),H7+2,H7+1)","v":5},{"$f":"IF(OR(MID($B6, I7+1,2)=\"NJ\",MID($B6, I7+1,2)=\"LJ\",MID($B6, I7+1,2)=\"DŽ\"),I7+2,I7+1)","v":6},{"$f":"IF(OR(MID($B6, J7+1,2)=\"NJ\",MID($B6, J7+1,2)=\"LJ\",MID($B6, J7+1,2)=\"DŽ\"),J7+2,J7+1)","v":7},{"$f":"IF(OR(MID($B6, K7+1,2)=\"NJ\",MID($B6, K7+1,2)=\"LJ\",MID($B6, K7+1,2)=\"DŽ\"),K7+2,K7+1)","v":8},{"$f":"IF(OR(MID($B6, L7+1,2)=\"NJ\",MID($B6, L7+1,2)=\"LJ\",MID($B6, L7+1,2)=\"DŽ\"),L7+2,L7+1)","v":9},{"$f":"IF(OR(MID($B6, M7+1,2)=\"NJ\",MID($B6, M7+1,2)=\"LJ\",MID($B6, M7+1,2)=\"DŽ\"),M7+2,M7+1)","v":10},{"$f":"IF(OR(MID($B6, N7+1,2)=\"NJ\",MID($B6, N7+1,2)=\"LJ\",MID($B6, N7+1,2)=\"DŽ\"),N7+2,N7+1)","v":11},{"$f":"IF(OR(MID($B6, O7+1,2)=\"NJ\",MID($B6, O7+1,2)=\"LJ\",MID($B6, O7+1,2)=\"DŽ\"),O7+2,O7+1)","v":12},{"$f":"IF(OR(MID($B6, P7+1,2)=\"NJ\",MID($B6, P7+1,2)=\"LJ\",MID($B6, P7+1,2)=\"DŽ\"),P7+2,P7+1)","v":13},{"$f":"IF(OR(MID($B6, Q7+1,2)=\"NJ\",MID($B6, Q7+1,2)=\"LJ\",MID($B6, Q7+1,2)=\"DŽ\"),Q7+2,Q7+1)","v":14},{"$f":"IF(OR(MID($B6, R7+1,2)=\"NJ\",MID($B6, R7+1,2)=\"LJ\",MID($B6, R7+1,2)=\"DŽ\"),R7+2,R7+1)","v":15},{"$f":"IF(OR(MID($B6, S7+1,2)=\"NJ\",MID($B6, S7+1,2)=\"LJ\",MID($B6, S7+1,2)=\"DŽ\"),S7+2,S7+1)","v":16},{"$f":"IF(OR(MID($B6, T7+1,2)=\"NJ\",MID($B6, T7+1,2)=\"LJ\",MID($B6, T7+1,2)=\"DŽ\"),T7+2,T7+1)","v":17},{"$f":"IF(OR(MID($B6, U7+1,2)=\"NJ\",MID($B6, U7+1,2)=\"LJ\",MID($B6, U7+1,2)=\"DŽ\"),U7+2,U7+1)","v":18},{"$f":"IF(OR(MID($B6, V7+1,2)=\"NJ\",MID($B6, V7+1,2)=\"LJ\",MID($B6, V7+1,2)=\"DŽ\"),V7+2,V7+1)","v":19},{"$f":"IF(OR(MID($B6, W7+1,2)=\"NJ\",MID($B6, W7+1,2)=\"LJ\",MID($B6, W7+1,2)=\"DŽ\"),W7+2,W7+1)","v":20},{"$f":"IF(OR(MID($B6, X7+1,2)=\"NJ\",MID($B6, X7+1,2)=\"LJ\",MID($B6, X7+1,2)=\"DŽ\"),X7+2,X7+1)","v":21},{"$f":"IF(OR(MID($B6, Y7+1,2)=\"NJ\",MID($B6, Y7+1,2)=\"LJ\",MID($B6, Y7+1,2)=\"DŽ\"),Y7+2,Y7+1)","v":22},{"$f":"IF(OR(MID($B6, Z7+1,2)=\"NJ\",MID($B6, Z7+1,2)=\"LJ\",MID($B6, Z7+1,2)=\"DŽ\"),Z7+2,Z7+1)","v":23},{"$f":"IF(OR(MID($B6, AA7+1,2)=\"NJ\",MID($B6, AA7+1,2)=\"LJ\",MID($B6, AA7+1,2)=\"DŽ\"),AA7+2,AA7+1)","v":24},{"$f":"IF(OR(MID($B6, AB7+1,2)=\"NJ\",MID($B6, AB7+1,2)=\"LJ\",MID($B6, AB7+1,2)=\"DŽ\"),AB7+2,AB7+1)","v":25},{"$f":"IF(OR(MID($B6, AC7+1,2)=\"NJ\",MID($B6, AC7+1,2)=\"LJ\",MID($B6, AC7+1,2)=\"DŽ\"),AC7+2,AC7+1)","v":26},{"$f":"IF(OR(MID($B6, AD7+1,2)=\"NJ\",MID($B6, AD7+1,2)=\"LJ\",MID($B6, AD7+1,2)=\"DŽ\"),AD7+2,AD7+1)","v":27},{"$f":"IF(OR(MID($B6, AE7+1,2)=\"NJ\",MID($B6, AE7+1,2)=\"LJ\",MID($B6, AE7+1,2)=\"DŽ\"),AE7+2,AE7+1)","v":28},{"$f":"IF(OR(MID($B6, AF7+1,2)=\"NJ\",MID($B6, AF7+1,2)=\"LJ\",MID($B6, AF7+1,2)=\"DŽ\"),AF7+2,AF7+1)","v":29},{"$f":"IF(OR(MID($B6, AG7+1,2)=\"NJ\",MID($B6, AG7+1,2)=\"LJ\",MID($B6, AG7+1,2)=\"DŽ\"),AG7+2,AG7+1)","v":30},{"$f":"IF(OR(MID($B6, AH7+1,2)=\"NJ\",MID($B6, AH7+1,2)=\"LJ\",MID($B6, AH7+1,2)=\"DŽ\"),AH7+2,AH7+1)","v":31},{"$f":"IF(OR(MID($B6, AI7+1,2)=\"NJ\",MID($B6, AI7+1,2)=\"LJ\",MID($B6, AI7+1,2)=\"DŽ\"),AI7+2,AI7+1)","v":32},{"$f":"IF(OR(MID($B6, AJ7+1,2)=\"NJ\",MID($B6, AJ7+1,2)=\"LJ\",MID($B6, AJ7+1,2)=\"DŽ\"),AJ7+2,AJ7+1)","v":33},{"$f":"IF(OR(MID($B6, AK7+1,2)=\"NJ\",MID($B6, AK7+1,2)=\"LJ\",MID($B6, AK7+1,2)=\"DŽ\"),AK7+2,AK7+1)","v":34},{"$f":"IF(OR(MID($B6, AL7+1,2)=\"NJ\",MID($B6, AL7+1,2)=\"LJ\",MID($B6, AL7+1,2)=\"DŽ\"),AL7+2,AL7+1)","v":35},{"$f":"IF(OR(MID($B6, AM7+1,2)=\"NJ\",MID($B6, AM7+1,2)=\"LJ\",MID($B6, AM7+1,2)=\"DŽ\"),AM7+2,AM7+1)","v":36},{"$f":"IF(OR(MID($B6, AN7+1,2)=\"NJ\",MID($B6, AN7+1,2)=\"LJ\",MID($B6, AN7+1,2)=\"DŽ\"),AN7+2,AN7+1)","v":37},{"$f":"IF(OR(MID($B6, AO7+1,2)=\"NJ\",MID($B6, AO7+1,2)=\"LJ\",MID($B6, AO7+1,2)=\"DŽ\"),AO7+2,AO7+1)","v":38},{"$f":"IF(OR(MID($B6, AP7+1,2)=\"NJ\",MID($B6, AP7+1,2)=\"LJ\",MID($B6, AP7+1,2)=\"DŽ\"),AP7+2,AP7+1)","v":39},{"$f":"IF(OR(MID($B6, AQ7+1,2)=\"NJ\",MID($B6, AQ7+1,2)=\"LJ\",MID($B6, AQ7+1,2)=\"DŽ\"),AQ7+2,AQ7+1)","v":40},{"$f":"IF(OR(MID($B6, AR7+1,2)=\"NJ\",MID($B6, AR7+1,2)=\"LJ\",MID($B6, AR7+1,2)=\"DŽ\"),AR7+2,AR7+1)","v":41},{"$f":"IF(OR(MID($B6, AS7+1,2)=\"NJ\",MID($B6, AS7+1,2)=\"LJ\",MID($B6, AS7+1,2)=\"DŽ\"),AS7+2,AS7+1)","v":42},{"$f":"IF(OR(MID($B6, AT7+1,2)=\"NJ\",MID($B6, AT7+1,2)=\"LJ\",MID($B6, AT7+1,2)=\"DŽ\"),AT7+2,AT7+1)","v":43},{"$f":"IF(OR(MID($B6, AU7+1,2)=\"NJ\",MID($B6, AU7+1,2)=\"LJ\",MID($B6, AU7+1,2)=\"DŽ\"),AU7+2,AU7+1)","v":44},{"$f":"IF(OR(MID($B6, AV7+1,2)=\"NJ\",MID($B6, AV7+1,2)=\"LJ\",MID($B6, AV7+1,2)=\"DŽ\"),AV7+2,AV7+1)","v":45},{"$f":"IF(OR(MID($B6, AW7+1,2)=\"NJ\",MID($B6, AW7+1,2)=\"LJ\",MID($B6, AW7+1,2)=\"DŽ\"),AW7+2,AW7+1)","v":46},{"$f":"IF(OR(MID($B6, AX7+1,2)=\"NJ\",MID($B6, AX7+1,2)=\"LJ\",MID($B6, AX7+1,2)=\"DŽ\"),AX7+2,AX7+1)","v":47},{"$f":"IF(OR(MID($B6, AY7+1,2)=\"NJ\",MID($B6, AY7+1,2)=\"LJ\",MID($B6, AY7+1,2)=\"DŽ\"),AY7+2,AY7+1)","v":48},{"$f":"IF(OR(MID($B6, AZ7+1,2)=\"NJ\",MID($B6, AZ7+1,2)=\"LJ\",MID($B6, AZ7+1,2)=\"DŽ\"),AZ7+2,AZ7+1)","v":49},{"$f":"IF(OR(MID($B6, BA7+1,2)=\"NJ\",MID($B6, BA7+1,2)=\"LJ\",MID($B6, BA7+1,2)=\"DŽ\"),BA7+2,BA7+1)","v":50},{"$f":"IF(OR(MID($B6, BB7+1,2)=\"NJ\",MID($B6, BB7+1,2)=\"LJ\",MID($B6, BB7+1,2)=\"DŽ\"),BB7+2,BB7+1)","v":51},{"$f":"IF(OR(MID($B6, BC7+1,2)=\"NJ\",MID($B6, BC7+1,2)=\"LJ\",MID($B6, BC7+1,2)=\"DŽ\"),BC7+2,BC7+1)","v":52},{"$f":"IF(OR(MID($B6, BD7+1,2)=\"NJ\",MID($B6, BD7+1,2)=\"LJ\",MID($B6, BD7+1,2)=\"DŽ\"),BD7+2,BD7+1)","v":53},{"$f":"IF(OR(MID($B6, BE7+1,2)=\"NJ\",MID($B6, BE7+1,2)=\"LJ\",MID($B6, BE7+1,2)=\"DŽ\"),BE7+2,BE7+1)","v":54},{"$f":"IF(OR(MID($B6, BF7+1,2)=\"NJ\",MID($B6, BF7+1,2)=\"LJ\",MID($B6, BF7+1,2)=\"DŽ\"),BF7+2,BF7+1)","v":55},{"$f":"IF(OR(MID($B6, BG7+1,2)=\"NJ\",MID($B6, BG7+1,2)=\"LJ\",MID($B6, BG7+1,2)=\"DŽ\"),BG7+2,BG7+1)","v":56},{"$f":"IF(OR(MID($B6, BH7+1,2)=\"NJ\",MID($B6, BH7+1,2)=\"LJ\",MID($B6, BH7+1,2)=\"DŽ\"),BH7+2,BH7+1)","v":57},{"$f":"IF(OR(MID($B6, BI7+1,2)=\"NJ\",MID($B6, BI7+1,2)=\"LJ\",MID($B6, BI7+1,2)=\"DŽ\"),BI7+2,BI7+1)","v":58},{"$f":"IF(OR(MID($B6, BJ7+1,2)=\"NJ\",MID($B6, BJ7+1,2)=\"LJ\",MID($B6, BJ7+1,2)=\"DŽ\"),BJ7+2,BJ7+1)","v":59},{"$f":"IF(OR(MID($B6, BK7+1,2)=\"NJ\",MID($B6, BK7+1,2)=\"LJ\",MID($B6, BK7+1,2)=\"DŽ\"),BK7+2,BK7+1)","v":60},{"$f":"IF(OR(MID($B6, BL7+1,2)=\"NJ\",MID($B6, BL7+1,2)=\"LJ\",MID($B6, BL7+1,2)=\"DŽ\"),BL7+2,BL7+1)","v":61},{"$f":"IF(OR(MID($B6, BM7+1,2)=\"NJ\",MID($B6, BM7+1,2)=\"LJ\",MID($B6, BM7+1,2)=\"DŽ\"),BM7+2,BM7+1)","v":62},{"$f":"IF(OR(MID($B6, BN7+1,2)=\"NJ\",MID($B6, BN7+1,2)=\"LJ\",MID($B6, BN7+1,2)=\"DŽ\"),BN7+2,BN7+1)","v":63},{"$f":"IF(OR(MID($B6, BO7+1,2)=\"NJ\",MID($B6, BO7+1,2)=\"LJ\",MID($B6, BO7+1,2)=\"DŽ\"),BO7+2,BO7+1)","v":64},{"$f":"IF(OR(MID($B6, BP7+1,2)=\"NJ\",MID($B6, BP7+1,2)=\"LJ\",MID($B6, BP7+1,2)=\"DŽ\"),BP7+2,BP7+1)","v":65},{"$f":"IF(OR(MID($B6, BQ7+1,2)=\"NJ\",MID($B6, BQ7+1,2)=\"LJ\",MID($B6, BQ7+1,2)=\"DŽ\"),BQ7+2,BQ7+1)","v":66},{"$f":"IF(OR(MID($B6, BR7+1,2)=\"NJ\",MID($B6, BR7+1,2)=\"LJ\",MID($B6, BR7+1,2)=\"DŽ\"),BR7+2,BR7+1)","v":67},{"$f":"IF(OR(MID($B6, BS7+1,2)=\"NJ\",MID($B6, BS7+1,2)=\"LJ\",MID($B6, BS7+1,2)=\"DŽ\"),BS7+2,BS7+1)","v":68},{"$f":"IF(OR(MID($B6, BT7+1,2)=\"NJ\",MID($B6, BT7+1,2)=\"LJ\",MID($B6, BT7+1,2)=\"DŽ\"),BT7+2,BT7+1)","v":69},{"$f":"IF(OR(MID($B6, BU7+1,2)=\"NJ\",MID($B6, BU7+1,2)=\"LJ\",MID($B6, BU7+1,2)=\"DŽ\"),BU7+2,BU7+1)","v":70}]
[4,"Ovo je primjer neke izjave.",27,4,{"$f":"IF(OR(LEFT(B8, 2) =\"NJ\", LEFT(B8, 2) =\"LJ\", LEFT(B8, 2) =\"DŽ\"), LEFT(B8, 2), LEFT(B8, 1))","v":"O"},{"$f":"IF(OR(MID($B8, E9+1,2) =\"NJ\", MID($B8, E9+1,2) =\"LJ\", MID($B8, E9+1,2) =\"DŽ\"), MID($B8, E9+1,2),MID($B8, E9+1,1))","v":"v"},"o"," ","j","e"," ","p","r","i","m","j","e","r"," ","n","e","k","e"," ","i","z","j","a","v","e",".","","","","","","","","","","","","","","","","","","","","","","","","","","","","","","","","","","","","","","","","","","",""]
[null,null,null,null,{"$f":"IF(OR(LEFT(B8, 2) =\"NJ\", LEFT(B8, 2) =\"LJ\", LEFT(B8, 2) =\"DŽ\"),2,1)","v":1},{"$f":"IF(OR(MID($B8, E9+1,2)=\"NJ\",MID($B8, E9+1,2)=\"LJ\",MID($B8, E9+1,2)=\"DŽ\"),E9+2,E9+1)","v":2},{"$f":"IF(OR(MID($B8, F9+1,2)=\"NJ\",MID($B8, F9+1,2)=\"LJ\",MID($B8, F9+1,2)=\"DŽ\"),F9+2,F9+1)","v":3},{"$f":"IF(OR(MID($B8, G9+1,2)=\"NJ\",MID($B8, G9+1,2)=\"LJ\",MID($B8, G9+1,2)=\"DŽ\"),G9+2,G9+1)","v":4},{"$f":"IF(OR(MID($B8, H9+1,2)=\"NJ\",MID($B8, H9+1,2)=\"LJ\",MID($B8, H9+1,2)=\"DŽ\"),H9+2,H9+1)","v":5},{"$f":"IF(OR(MID($B8, I9+1,2)=\"NJ\",MID($B8, I9+1,2)=\"LJ\",MID($B8, I9+1,2)=\"DŽ\"),I9+2,I9+1)","v":6},{"$f":"IF(OR(MID($B8, J9+1,2)=\"NJ\",MID($B8, J9+1,2)=\"LJ\",MID($B8, J9+1,2)=\"DŽ\"),J9+2,J9+1)","v":7},{"$f":"IF(OR(MID($B8, K9+1,2)=\"NJ\",MID($B8, K9+1,2)=\"LJ\",MID($B8, K9+1,2)=\"DŽ\"),K9+2,K9+1)","v":8},{"$f":"IF(OR(MID($B8, L9+1,2)=\"NJ\",MID($B8, L9+1,2)=\"LJ\",MID($B8, L9+1,2)=\"DŽ\"),L9+2,L9+1)","v":9},{"$f":"IF(OR(MID($B8, M9+1,2)=\"NJ\",MID($B8, M9+1,2)=\"LJ\",MID($B8, M9+1,2)=\"DŽ\"),M9+2,M9+1)","v":10},{"$f":"IF(OR(MID($B8, N9+1,2)=\"NJ\",MID($B8, N9+1,2)=\"LJ\",MID($B8, N9+1,2)=\"DŽ\"),N9+2,N9+1)","v":11},{"$f":"IF(OR(MID($B8, O9+1,2)=\"NJ\",MID($B8, O9+1,2)=\"LJ\",MID($B8, O9+1,2)=\"DŽ\"),O9+2,O9+1)","v":12},{"$f":"IF(OR(MID($B8, P9+1,2)=\"NJ\",MID($B8, P9+1,2)=\"LJ\",MID($B8, P9+1,2)=\"DŽ\"),P9+2,P9+1)","v":13},{"$f":"IF(OR(MID($B8, Q9+1,2)=\"NJ\",MID($B8, Q9+1,2)=\"LJ\",MID($B8, Q9+1,2)=\"DŽ\"),Q9+2,Q9+1)","v":14},{"$f":"IF(OR(MID($B8, R9+1,2)=\"NJ\",MID($B8, R9+1,2)=\"LJ\",MID($B8, R9+1,2)=\"DŽ\"),R9+2,R9+1)","v":15},{"$f":"IF(OR(MID($B8, S9+1,2)=\"NJ\",MID($B8, S9+1,2)=\"LJ\",MID($B8, S9+1,2)=\"DŽ\"),S9+2,S9+1)","v":16},{"$f":"IF(OR(MID($B8, T9+1,2)=\"NJ\",MID($B8, T9+1,2)=\"LJ\",MID($B8, T9+1,2)=\"DŽ\"),T9+2,T9+1)","v":17},{"$f":"IF(OR(MID($B8, U9+1,2)=\"NJ\",MID($B8, U9+1,2)=\"LJ\",MID($B8, U9+1,2)=\"DŽ\"),U9+2,U9+1)","v":18},{"$f":"IF(OR(MID($B8, V9+1,2)=\"NJ\",MID($B8, V9+1,2)=\"LJ\",MID($B8, V9+1,2)=\"DŽ\"),V9+2,V9+1)","v":19},{"$f":"IF(OR(MID($B8, W9+1,2)=\"NJ\",MID($B8, W9+1,2)=\"LJ\",MID($B8, W9+1,2)=\"DŽ\"),W9+2,W9+1)","v":20},{"$f":"IF(OR(MID($B8, X9+1,2)=\"NJ\",MID($B8, X9+1,2)=\"LJ\",MID($B8, X9+1,2)=\"DŽ\"),X9+2,X9+1)","v":21},{"$f":"IF(OR(MID($B8, Y9+1,2)=\"NJ\",MID($B8, Y9+1,2)=\"LJ\",MID($B8, Y9+1,2)=\"DŽ\"),Y9+2,Y9+1)","v":22},{"$f":"IF(OR(MID($B8, Z9+1,2)=\"NJ\",MID($B8, Z9+1,2)=\"LJ\",MID($B8, Z9+1,2)=\"DŽ\"),Z9+2,Z9+1)","v":23},{"$f":"IF(OR(MID($B8, AA9+1,2)=\"NJ\",MID($B8, AA9+1,2)=\"LJ\",MID($B8, AA9+1,2)=\"DŽ\"),AA9+2,AA9+1)","v":24},{"$f":"IF(OR(MID($B8, AB9+1,2)=\"NJ\",MID($B8, AB9+1,2)=\"LJ\",MID($B8, AB9+1,2)=\"DŽ\"),AB9+2,AB9+1)","v":25},{"$f":"IF(OR(MID($B8, AC9+1,2)=\"NJ\",MID($B8, AC9+1,2)=\"LJ\",MID($B8, AC9+1,2)=\"DŽ\"),AC9+2,AC9+1)","v":26},{"$f":"IF(OR(MID($B8, AD9+1,2)=\"NJ\",MID($B8, AD9+1,2)=\"LJ\",MID($B8, AD9+1,2)=\"DŽ\"),AD9+2,AD9+1)","v":27},{"$f":"IF(OR(MID($B8, AE9+1,2)=\"NJ\",MID($B8, AE9+1,2)=\"LJ\",MID($B8, AE9+1,2)=\"DŽ\"),AE9+2,AE9+1)","v":28},{"$f":"IF(OR(MID($B8, AF9+1,2)=\"NJ\",MID($B8, AF9+1,2)=\"LJ\",MID($B8, AF9+1,2)=\"DŽ\"),AF9+2,AF9+1)","v":29},{"$f":"IF(OR(MID($B8, AG9+1,2)=\"NJ\",MID($B8, AG9+1,2)=\"LJ\",MID($B8, AG9+1,2)=\"DŽ\"),AG9+2,AG9+1)","v":30},{"$f":"IF(OR(MID($B8, AH9+1,2)=\"NJ\",MID($B8, AH9+1,2)=\"LJ\",MID($B8, AH9+1,2)=\"DŽ\"),AH9+2,AH9+1)","v":31},{"$f":"IF(OR(MID($B8, AI9+1,2)=\"NJ\",MID($B8, AI9+1,2)=\"LJ\",MID($B8, AI9+1,2)=\"DŽ\"),AI9+2,AI9+1)","v":32},{"$f":"IF(OR(MID($B8, AJ9+1,2)=\"NJ\",MID($B8, AJ9+1,2)=\"LJ\",MID($B8, AJ9+1,2)=\"DŽ\"),AJ9+2,AJ9+1)","v":33},{"$f":"IF(OR(MID($B8, AK9+1,2)=\"NJ\",MID($B8, AK9+1,2)=\"LJ\",MID($B8, AK9+1,2)=\"DŽ\"),AK9+2,AK9+1)","v":34},{"$f":"IF(OR(MID($B8, AL9+1,2)=\"NJ\",MID($B8, AL9+1,2)=\"LJ\",MID($B8, AL9+1,2)=\"DŽ\"),AL9+2,AL9+1)","v":35},{"$f":"IF(OR(MID($B8, AM9+1,2)=\"NJ\",MID($B8, AM9+1,2)=\"LJ\",MID($B8, AM9+1,2)=\"DŽ\"),AM9+2,AM9+1)","v":36},{"$f":"IF(OR(MID($B8, AN9+1,2)=\"NJ\",MID($B8, AN9+1,2)=\"LJ\",MID($B8, AN9+1,2)=\"DŽ\"),AN9+2,AN9+1)","v":37},{"$f":"IF(OR(MID($B8, AO9+1,2)=\"NJ\",MID($B8, AO9+1,2)=\"LJ\",MID($B8, AO9+1,2)=\"DŽ\"),AO9+2,AO9+1)","v":38},{"$f":"IF(OR(MID($B8, AP9+1,2)=\"NJ\",MID($B8, AP9+1,2)=\"LJ\",MID($B8, AP9+1,2)=\"DŽ\"),AP9+2,AP9+1)","v":39},{"$f":"IF(OR(MID($B8, AQ9+1,2)=\"NJ\",MID($B8, AQ9+1,2)=\"LJ\",MID($B8, AQ9+1,2)=\"DŽ\"),AQ9+2,AQ9+1)","v":40},{"$f":"IF(OR(MID($B8, AR9+1,2)=\"NJ\",MID($B8, AR9+1,2)=\"LJ\",MID($B8, AR9+1,2)=\"DŽ\"),AR9+2,AR9+1)","v":41},{"$f":"IF(OR(MID($B8, AS9+1,2)=\"NJ\",MID($B8, AS9+1,2)=\"LJ\",MID($B8, AS9+1,2)=\"DŽ\"),AS9+2,AS9+1)","v":42},{"$f":"IF(OR(MID($B8, AT9+1,2)=\"NJ\",MID($B8, AT9+1,2)=\"LJ\",MID($B8, AT9+1,2)=\"DŽ\"),AT9+2,AT9+1)","v":43},{"$f":"IF(OR(MID($B8, AU9+1,2)=\"NJ\",MID($B8, AU9+1,2)=\"LJ\",MID($B8, AU9+1,2)=\"DŽ\"),AU9+2,AU9+1)","v":44},{"$f":"IF(OR(MID($B8, AV9+1,2)=\"NJ\",MID($B8, AV9+1,2)=\"LJ\",MID($B8, AV9+1,2)=\"DŽ\"),AV9+2,AV9+1)","v":45},{"$f":"IF(OR(MID($B8, AW9+1,2)=\"NJ\",MID($B8, AW9+1,2)=\"LJ\",MID($B8, AW9+1,2)=\"DŽ\"),AW9+2,AW9+1)","v":46},{"$f":"IF(OR(MID($B8, AX9+1,2)=\"NJ\",MID($B8, AX9+1,2)=\"LJ\",MID($B8, AX9+1,2)=\"DŽ\"),AX9+2,AX9+1)","v":47},{"$f":"IF(OR(MID($B8, AY9+1,2)=\"NJ\",MID($B8, AY9+1,2)=\"LJ\",MID($B8, AY9+1,2)=\"DŽ\"),AY9+2,AY9+1)","v":48},{"$f":"IF(OR(MID($B8, AZ9+1,2)=\"NJ\",MID($B8, AZ9+1,2)=\"LJ\",MID($B8, AZ9+1,2)=\"DŽ\"),AZ9+2,AZ9+1)","v":49},{"$f":"IF(OR(MID($B8, BA9+1,2)=\"NJ\",MID($B8, BA9+1,2)=\"LJ\",MID($B8, BA9+1,2)=\"DŽ\"),BA9+2,BA9+1)","v":50},{"$f":"IF(OR(MID($B8, BB9+1,2)=\"NJ\",MID($B8, BB9+1,2)=\"LJ\",MID($B8, BB9+1,2)=\"DŽ\"),BB9+2,BB9+1)","v":51},{"$f":"IF(OR(MID($B8, BC9+1,2)=\"NJ\",MID($B8, BC9+1,2)=\"LJ\",MID($B8, BC9+1,2)=\"DŽ\"),BC9+2,BC9+1)","v":52},{"$f":"IF(OR(MID($B8, BD9+1,2)=\"NJ\",MID($B8, BD9+1,2)=\"LJ\",MID($B8, BD9+1,2)=\"DŽ\"),BD9+2,BD9+1)","v":53},{"$f":"IF(OR(MID($B8, BE9+1,2)=\"NJ\",MID($B8, BE9+1,2)=\"LJ\",MID($B8, BE9+1,2)=\"DŽ\"),BE9+2,BE9+1)","v":54},{"$f":"IF(OR(MID($B8, BF9+1,2)=\"NJ\",MID($B8, BF9+1,2)=\"LJ\",MID($B8, BF9+1,2)=\"DŽ\"),BF9+2,BF9+1)","v":55},{"$f":"IF(OR(MID($B8, BG9+1,2)=\"NJ\",MID($B8, BG9+1,2)=\"LJ\",MID($B8, BG9+1,2)=\"DŽ\"),BG9+2,BG9+1)","v":56},{"$f":"IF(OR(MID($B8, BH9+1,2)=\"NJ\",MID($B8, BH9+1,2)=\"LJ\",MID($B8, BH9+1,2)=\"DŽ\"),BH9+2,BH9+1)","v":57},{"$f":"IF(OR(MID($B8, BI9+1,2)=\"NJ\",MID($B8, BI9+1,2)=\"LJ\",MID($B8, BI9+1,2)=\"DŽ\"),BI9+2,BI9+1)","v":58},{"$f":"IF(OR(MID($B8, BJ9+1,2)=\"NJ\",MID($B8, BJ9+1,2)=\"LJ\",MID($B8, BJ9+1,2)=\"DŽ\"),BJ9+2,BJ9+1)","v":59},{"$f":"IF(OR(MID($B8, BK9+1,2)=\"NJ\",MID($B8, BK9+1,2)=\"LJ\",MID($B8, BK9+1,2)=\"DŽ\"),BK9+2,BK9+1)","v":60},{"$f":"IF(OR(MID($B8, BL9+1,2)=\"NJ\",MID($B8, BL9+1,2)=\"LJ\",MID($B8, BL9+1,2)=\"DŽ\"),BL9+2,BL9+1)","v":61},{"$f":"IF(OR(MID($B8, BM9+1,2)=\"NJ\",MID($B8, BM9+1,2)=\"LJ\",MID($B8, BM9+1,2)=\"DŽ\"),BM9+2,BM9+1)","v":62},{"$f":"IF(OR(MID($B8, BN9+1,2)=\"NJ\",MID($B8, BN9+1,2)=\"LJ\",MID($B8, BN9+1,2)=\"DŽ\"),BN9+2,BN9+1)","v":63},{"$f":"IF(OR(MID($B8, BO9+1,2)=\"NJ\",MID($B8, BO9+1,2)=\"LJ\",MID($B8, BO9+1,2)=\"DŽ\"),BO9+2,BO9+1)","v":64},{"$f":"IF(OR(MID($B8, BP9+1,2)=\"NJ\",MID($B8, BP9+1,2)=\"LJ\",MID($B8, BP9+1,2)=\"DŽ\"),BP9+2,BP9+1)","v":65},{"$f":"IF(OR(MID($B8, BQ9+1,2)=\"NJ\",MID($B8, BQ9+1,2)=\"LJ\",MID($B8, BQ9+1,2)=\"DŽ\"),BQ9+2,BQ9+1)","v":66},{"$f":"IF(OR(MID($B8, BR9+1,2)=\"NJ\",MID($B8, BR9+1,2)=\"LJ\",MID($B8, BR9+1,2)=\"DŽ\"),BR9+2,BR9+1)","v":67},{"$f":"IF(OR(MID($B8, BS9+1,2)=\"NJ\",MID($B8, BS9+1,2)=\"LJ\",MID($B8, BS9+1,2)=\"DŽ\"),BS9+2,BS9+1)","v":68},{"$f":"IF(OR(MID($B8, BT9+1,2)=\"NJ\",MID($B8, BT9+1,2)=\"LJ\",MID($B8, BT9+1,2)=\"DŽ\"),BT9+2,BT9+1)","v":69},{"$f":"IF(OR(MID($B8, BU9+1,2)=\"NJ\",MID($B8, BU9+1,2)=\"LJ\",MID($B8, BU9+1,2)=\"DŽ\"),BU9+2,BU9+1)","v":70}]
[5,"Mogu se koristiti zarezi, ali i ostali interpunkcijski znakovi: ?;!",67,5,{"$f":"IF(OR(LEFT(B10, 2) =\"NJ\", LEFT(B10, 2) =\"LJ\", LEFT(B10, 2) =\"DŽ\"), LEFT(B10, 2), LEFT(B10, 1))","v":"M"},{"$f":"IF(OR(MID($B10, E11+1,2) =\"NJ\", MID($B10, E11+1,2) =\"LJ\", MID($B10, E11+1,2) =\"DŽ\"), MID($B10, E11+1,2),MID($B10, E11+1,1))","v":"o"},"g","u"," ","s","e"," ","k","o","r","i","s","t","i","t","i"," ","z","a","r","e","z","i",","," ","a","l","i"," ","i"," ","o","s","t","a","l","i"," ","i","n","t","e","r","p","u","n","k","c","i","j","s","k","i"," ","z","n","a","k","o","v","i",":"," ","?",{"$f":"IF(OR(MID($B10, BQ11+1,2) =\"NJ\", MID($B10, BQ11+1,2) =\"LJ\", MID($B10, BQ11+1,2) =\"DŽ\"), MID($B10, BQ11+1,2),MID($B10, BQ11+1,1))","v":";"},"!","","",""]
[null,null,null,null,{"$f":"IF(OR(LEFT(B10, 2) =\"NJ\", LEFT(B10, 2) =\"LJ\", LEFT(B10, 2) =\"DŽ\"),2,1)","v":1},{"$f":"IF(OR(MID($B10, E11+1,2)=\"NJ\",MID($B10, E11+1,2)=\"LJ\",MID($B10, E11+1,2)=\"DŽ\"),E11+2,E11+1)","v":2},{"$f":"IF(OR(MID($B10, F11+1,2)=\"NJ\",MID($B10, F11+1,2)=\"LJ\",MID($B10, F11+1,2)=\"DŽ\"),F11+2,F11+1)","v":3},{"$f":"IF(OR(MID($B10, G11+1,2)=\"NJ\",MID($B10, G11+1,2)=\"LJ\",MID($B10, G11+1,2)=\"DŽ\"),G11+2,G11+1)","v":4},{"$f":"IF(OR(MID($B10, H11+1,2)=\"NJ\",MID($B10, H11+1,2)=\"LJ\",MID($B10, H11+1,2)=\"DŽ\"),H11+2,H11+1)","v":5},{"$f":"IF(OR(MID($B10, I11+1,2)=\"NJ\",MID($B10, I11+1,2)=\"LJ\",MID($B10, I11+1,2)=\"DŽ\"),I11+2,I11+1)","v":6},{"$f":"IF(OR(MID($B10, J11+1,2)=\"NJ\",MID($B10, J11+1,2)=\"LJ\",MID($B10, J11+1,2)=\"DŽ\"),J11+2,J11+1)","v":7},{"$f":"IF(OR(MID($B10, K11+1,2)=\"NJ\",MID($B10, K11+1,2)=\"LJ\",MID($B10, K11+1,2)=\"DŽ\"),K11+2,K11+1)","v":8},{"$f":"IF(OR(MID($B10, L11+1,2)=\"NJ\",MID($B10, L11+1,2)=\"LJ\",MID($B10, L11+1,2)=\"DŽ\"),L11+2,L11+1)","v":9},{"$f":"IF(OR(MID($B10, M11+1,2)=\"NJ\",MID($B10, M11+1,2)=\"LJ\",MID($B10, M11+1,2)=\"DŽ\"),M11+2,M11+1)","v":10},{"$f":"IF(OR(MID($B10, N11+1,2)=\"NJ\",MID($B10, N11+1,2)=\"LJ\",MID($B10, N11+1,2)=\"DŽ\"),N11+2,N11+1)","v":11},{"$f":"IF(OR(MID($B10, O11+1,2)=\"NJ\",MID($B10, O11+1,2)=\"LJ\",MID($B10, O11+1,2)=\"DŽ\"),O11+2,O11+1)","v":12},{"$f":"IF(OR(MID($B10, P11+1,2)=\"NJ\",MID($B10, P11+1,2)=\"LJ\",MID($B10, P11+1,2)=\"DŽ\"),P11+2,P11+1)","v":13},{"$f":"IF(OR(MID($B10, Q11+1,2)=\"NJ\",MID($B10, Q11+1,2)=\"LJ\",MID($B10, Q11+1,2)=\"DŽ\"),Q11+2,Q11+1)","v":14},{"$f":"IF(OR(MID($B10, R11+1,2)=\"NJ\",MID($B10, R11+1,2)=\"LJ\",MID($B10, R11+1,2)=\"DŽ\"),R11+2,R11+1)","v":15},{"$f":"IF(OR(MID($B10, S11+1,2)=\"NJ\",MID($B10, S11+1,2)=\"LJ\",MID($B10, S11+1,2)=\"DŽ\"),S11+2,S11+1)","v":16},{"$f":"IF(OR(MID($B10, T11+1,2)=\"NJ\",MID($B10, T11+1,2)=\"LJ\",MID($B10, T11+1,2)=\"DŽ\"),T11+2,T11+1)","v":17},{"$f":"IF(OR(MID($B10, U11+1,2)=\"NJ\",MID($B10, U11+1,2)=\"LJ\",MID($B10, U11+1,2)=\"DŽ\"),U11+2,U11+1)","v":18},{"$f":"IF(OR(MID($B10, V11+1,2)=\"NJ\",MID($B10, V11+1,2)=\"LJ\",MID($B10, V11+1,2)=\"DŽ\"),V11+2,V11+1)","v":19},{"$f":"IF(OR(MID($B10, W11+1,2)=\"NJ\",MID($B10, W11+1,2)=\"LJ\",MID($B10, W11+1,2)=\"DŽ\"),W11+2,W11+1)","v":20},{"$f":"IF(OR(MID($B10, X11+1,2)=\"NJ\",MID($B10, X11+1,2)=\"LJ\",MID($B10, X11+1,2)=\"DŽ\"),X11+2,X11+1)","v":21},{"$f":"IF(OR(MID($B10, Y11+1,2)=\"NJ\",MID($B10, Y11+1,2)=\"LJ\",MID($B10, Y11+1,2)=\"DŽ\"),Y11+2,Y11+1)","v":22},{"$f":"IF(OR(MID($B10, Z11+1,2)=\"NJ\",MID($B10, Z11+1,2)=\"LJ\",MID($B10, Z11+1,2)=\"DŽ\"),Z11+2,Z11+1)","v":23},{"$f":"IF(OR(MID($B10, AA11+1,2)=\"NJ\",MID($B10, AA11+1,2)=\"LJ\",MID($B10, AA11+1,2)=\"DŽ\"),AA11+2,AA11+1)","v":24},{"$f":"IF(OR(MID($B10, AB11+1,2)=\"NJ\",MID($B10, AB11+1,2)=\"LJ\",MID($B10, AB11+1,2)=\"DŽ\"),AB11+2,AB11+1)","v":25},{"$f":"IF(OR(MID($B10, AC11+1,2)=\"NJ\",MID($B10, AC11+1,2)=\"LJ\",MID($B10, AC11+1,2)=\"DŽ\"),AC11+2,AC11+1)","v":26},{"$f":"IF(OR(MID($B10, AD11+1,2)=\"NJ\",MID($B10, AD11+1,2)=\"LJ\",MID($B10, AD11+1,2)=\"DŽ\"),AD11+2,AD11+1)","v":27},{"$f":"IF(OR(MID($B10, AE11+1,2)=\"NJ\",MID($B10, AE11+1,2)=\"LJ\",MID($B10, AE11+1,2)=\"DŽ\"),AE11+2,AE11+1)","v":28},{"$f":"IF(OR(MID($B10, AF11+1,2)=\"NJ\",MID($B10, AF11+1,2)=\"LJ\",MID($B10, AF11+1,2)=\"DŽ\"),AF11+2,AF11+1)","v":29},{"$f":"IF(OR(MID($B10, AG11+1,2)=\"NJ\",MID($B10, AG11+1,2)=\"LJ\",MID($B10, AG11+1,2)=\"DŽ\"),AG11+2,AG11+1)","v":30},{"$f":"IF(OR(MID($B10, AH11+1,2)=\"NJ\",MID($B10, AH11+1,2)=\"LJ\",MID($B10, AH11+1,2)=\"DŽ\"),AH11+2,AH11+1)","v":31},{"$f":"IF(OR(MID($B10, AI11+1,2)=\"NJ\",MID($B10, AI11+1,2)=\"LJ\",MID($B10, AI11+1,2)=\"DŽ\"),AI11+2,AI11+1)","v":32},{"$f":"IF(OR(MID($B10, AJ11+1,2)=\"NJ\",MID($B10, AJ11+1,2)=\"LJ\",MID($B10, AJ11+1,2)=\"DŽ\"),AJ11+2,AJ11+1)","v":33},{"$f":"IF(OR(MID($B10, AK11+1,2)=\"NJ\",MID($B10, AK11+1,2)=\"LJ\",MID($B10, AK11+1,2)=\"DŽ\"),AK11+2,AK11+1)","v":34},{"$f":"IF(OR(MID($B10, AL11+1,2)=\"NJ\",MID($B10, AL11+1,2)=\"LJ\",MID($B10, AL11+1,2)=\"DŽ\"),AL11+2,AL11+1)","v":35},{"$f":"IF(OR(MID($B10, AM11+1,2)=\"NJ\",MID($B10, AM11+1,2)=\"LJ\",MID($B10, AM11+1,2)=\"DŽ\"),AM11+2,AM11+1)","v":36},{"$f":"IF(OR(MID($B10, AN11+1,2)=\"NJ\",MID($B10, AN11+1,2)=\"LJ\",MID($B10, AN11+1,2)=\"DŽ\"),AN11+2,AN11+1)","v":37},{"$f":"IF(OR(MID($B10, AO11+1,2)=\"NJ\",MID($B10, AO11+1,2)=\"LJ\",MID($B10, AO11+1,2)=\"DŽ\"),AO11+2,AO11+1)","v":38},{"$f":"IF(OR(MID($B10, AP11+1,2)=\"NJ\",MID($B10, AP11+1,2)=\"LJ\",MID($B10, AP11+1,2)=\"DŽ\"),AP11+2,AP11+1)","v":39},{"$f":"IF(OR(MID($B10, AQ11+1,2)=\"NJ\",MID($B10, AQ11+1,2)=\"LJ\",MID($B10, AQ11+1,2)=\"DŽ\"),AQ11+2,AQ11+1)","v":40},{"$f":"IF(OR(MID($B10, AR11+1,2)=\"NJ\",MID($B10, AR11+1,2)=\"LJ\",MID($B10, AR11+1,2)=\"DŽ\"),AR11+2,AR11+1)","v":41},{"$f":"IF(OR(MID($B10, AS11+1,2)=\"NJ\",MID($B10, AS11+1,2)=\"LJ\",MID($B10, AS11+1,2)=\"DŽ\"),AS11+2,AS11+1)","v":42},{"$f":"IF(OR(MID($B10, AT11+1,2)=\"NJ\",MID($B10, AT11+1,2)=\"LJ\",MID($B10, AT11+1,2)=\"DŽ\"),AT11+2,AT11+1)","v":43},{"$f":"IF(OR(MID($B10, AU11+1,2)=\"NJ\",MID($B10, AU11+1,2)=\"LJ\",MID($B10, AU11+1,2)=\"DŽ\"),AU11+2,AU11+1)","v":44},{"$f":"IF(OR(MID($B10, AV11+1,2)=\"NJ\",MID($B10, AV11+1,2)=\"LJ\",MID($B10, AV11+1,2)=\"DŽ\"),AV11+2,AV11+1)","v":45},{"$f":"IF(OR(MID($B10, AW11+1,2)=\"NJ\",MID($B10, AW11+1,2)=\"LJ\",MID($B10, AW11+1,2)=\"DŽ\"),AW11+2,AW11+1)","v":46},{"$f":"IF(OR(MID($B10, AX11+1,2)=\"NJ\",MID($B10, AX11+1,2)=\"LJ\",MID($B10, AX11+1,2)=\"DŽ\"),AX11+2,AX11+1)","v":47},{"$f":"IF(OR(MID($B10, AY11+1,2)=\"NJ\",MID($B10, AY11+1,2)=\"LJ\",MID($B10, AY11+1,2)=\"DŽ\"),AY11+2,AY11+1)","v":48},{"$f":"IF(OR(MID($B10, AZ11+1,2)=\"NJ\",MID($B10, AZ11+1,2)=\"LJ\",MID($B10, AZ11+1,2)=\"DŽ\"),AZ11+2,AZ11+1)","v":49},{"$f":"IF(OR(MID($B10, BA11+1,2)=\"NJ\",MID($B10, BA11+1,2)=\"LJ\",MID($B10, BA11+1,2)=\"DŽ\"),BA11+2,BA11+1)","v":50},{"$f":"IF(OR(MID($B10, BB11+1,2)=\"NJ\",MID($B10, BB11+1,2)=\"LJ\",MID($B10, BB11+1,2)=\"DŽ\"),BB11+2,BB11+1)","v":51},{"$f":"IF(OR(MID($B10, BC11+1,2)=\"NJ\",MID($B10, BC11+1,2)=\"LJ\",MID($B10, BC11+1,2)=\"DŽ\"),BC11+2,BC11+1)","v":52},{"$f":"IF(OR(MID($B10, BD11+1,2)=\"NJ\",MID($B10, BD11+1,2)=\"LJ\",MID($B10, BD11+1,2)=\"DŽ\"),BD11+2,BD11+1)","v":53},{"$f":"IF(OR(MID($B10, BE11+1,2)=\"NJ\",MID($B10, BE11+1,2)=\"LJ\",MID($B10, BE11+1,2)=\"DŽ\"),BE11+2,BE11+1)","v":54},{"$f":"IF(OR(MID($B10, BF11+1,2)=\"NJ\",MID($B10, BF11+1,2)=\"LJ\",MID($B10, BF11+1,2)=\"DŽ\"),BF11+2,BF11+1)","v":55},{"$f":"IF(OR(MID($B10, BG11+1,2)=\"NJ\",MID($B10, BG11+1,2)=\"LJ\",MID($B10, BG11+1,2)=\"DŽ\"),BG11+2,BG11+1)","v":56},{"$f":"IF(OR(MID($B10, BH11+1,2)=\"NJ\",MID($B10, BH11+1,2)=\"LJ\",MID($B10, BH11+1,2)=\"DŽ\"),BH11+2,BH11+1)","v":57},{"$f":"IF(OR(MID($B10, BI11+1,2)=\"NJ\",MID($B10, BI11+1,2)=\"LJ\",MID($B10, BI11+1,2)=\"DŽ\"),BI11+2,BI11+1)","v":58},{"$f":"IF(OR(MID($B10, BJ11+1,2)=\"NJ\",MID($B10, BJ11+1,2)=\"LJ\",MID($B10, BJ11+1,2)=\"DŽ\"),BJ11+2,BJ11+1)","v":59},{"$f":"IF(OR(MID($B10, BK11+1,2)=\"NJ\",MID($B10, BK11+1,2)=\"LJ\",MID($B10, BK11+1,2)=\"DŽ\"),BK11+2,BK11+1)","v":60},{"$f":"IF(OR(MID($B10, BL11+1,2)=\"NJ\",MID($B10, BL11+1,2)=\"LJ\",MID($B10, BL11+1,2)=\"DŽ\"),BL11+2,BL11+1)","v":61},{"$f":"IF(OR(MID($B10, BM11+1,2)=\"NJ\",MID($B10, BM11+1,2)=\"LJ\",MID($B10, BM11+1,2)=\"DŽ\"),BM11+2,BM11+1)","v":62},{"$f":"IF(OR(MID($B10, BN11+1,2)=\"NJ\",MID($B10, BN11+1,2)=\"LJ\",MID($B10, BN11+1,2)=\"DŽ\"),BN11+2,BN11+1)","v":63},{"$f":"IF(OR(MID($B10, BO11+1,2)=\"NJ\",MID($B10, BO11+1,2)=\"LJ\",MID($B10, BO11+1,2)=\"DŽ\"),BO11+2,BO11+1)","v":64},{"$f":"IF(OR(MID($B10, BP11+1,2)=\"NJ\",MID($B10, BP11+1,2)=\"LJ\",MID($B10, BP11+1,2)=\"DŽ\"),BP11+2,BP11+1)","v":65},{"$f":"IF(OR(MID($B10, BQ11+1,2)=\"NJ\",MID($B10, BQ11+1,2)=\"LJ\",MID($B10, BQ11+1,2)=\"DŽ\"),BQ11+2,BQ11+1)","v":66},{"$f":"IF(OR(MID($B10, BR11+1,2)=\"NJ\",MID($B10, BR11+1,2)=\"LJ\",MID($B10, BR11+1,2)=\"DŽ\"),BR11+2,BR11+1)","v":67},{"$f":"IF(OR(MID($B10, BS11+1,2)=\"NJ\",MID($B10, BS11+1,2)=\"LJ\",MID($B10, BS11+1,2)=\"DŽ\"),BS11+2,BS11+1)","v":68},{"$f":"IF(OR(MID($B10, BT11+1,2)=\"NJ\",MID($B10, BT11+1,2)=\"LJ\",MID($B10, BT11+1,2)=\"DŽ\"),BT11+2,BT11+1)","v":69},{"$f":"IF(OR(MID($B10, BU11+1,2)=\"NJ\",MID($B10, BU11+1,2)=\"LJ\",MID($B10, BU11+1,2)=\"DŽ\"),BU11+2,BU11+1)","v":70}]
[6,"Ukoliko je neka izjava duža od 70 znakova, ovakav će se redak zacrvenjeti.","Previše!",6,{"$f":"IF(OR(LEFT(B12, 2) =\"NJ\", LEFT(B12, 2) =\"LJ\", LEFT(B12, 2) =\"DŽ\"), LEFT(B12, 2), LEFT(B12, 1))","v":"U"},{"$f":"IF(OR(MID($B12, E13+1,2) =\"NJ\", MID($B12, E13+1,2) =\"LJ\", MID($B12, E13+1,2) =\"DŽ\"), MID($B12, E13+1,2),MID($B12, E13+1,1))","v":"k"},"o","l","i","k","o"," ","j","e"," ","n","e","k","a"," ","i","z","j","a","v","a"," ","d","u","ž","a"," ","o","d"," ","7","0"," ","z","n","a","k","o","v","a",","," ","o","v","a","k","a","v"," ","ć","e"," ","s","e"," ","r","e","d","a","k"," ","z","a","c","r","v","e","nj","e"]
[null,null,null,null,{"$f":"IF(OR(LEFT(B12, 2) =\"NJ\", LEFT(B12, 2) =\"LJ\", LEFT(B12, 2) =\"DŽ\"),2,1)","v":1},{"$f":"IF(OR(MID($B12, E13+1,2)=\"NJ\",MID($B12, E13+1,2)=\"LJ\",MID($B12, E13+1,2)=\"DŽ\"),E13+2,E13+1)","v":2},{"$f":"IF(OR(MID($B12, F13+1,2)=\"NJ\",MID($B12, F13+1,2)=\"LJ\",MID($B12, F13+1,2)=\"DŽ\"),F13+2,F13+1)","v":3},{"$f":"IF(OR(MID($B12, G13+1,2)=\"NJ\",MID($B12, G13+1,2)=\"LJ\",MID($B12, G13+1,2)=\"DŽ\"),G13+2,G13+1)","v":4},{"$f":"IF(OR(MID($B12, H13+1,2)=\"NJ\",MID($B12, H13+1,2)=\"LJ\",MID($B12, H13+1,2)=\"DŽ\"),H13+2,H13+1)","v":5},{"$f":"IF(OR(MID($B12, I13+1,2)=\"NJ\",MID($B12, I13+1,2)=\"LJ\",MID($B12, I13+1,2)=\"DŽ\"),I13+2,I13+1)","v":6},{"$f":"IF(OR(MID($B12, J13+1,2)=\"NJ\",MID($B12, J13+1,2)=\"LJ\",MID($B12, J13+1,2)=\"DŽ\"),J13+2,J13+1)","v":7},{"$f":"IF(OR(MID($B12, K13+1,2)=\"NJ\",MID($B12, K13+1,2)=\"LJ\",MID($B12, K13+1,2)=\"DŽ\"),K13+2,K13+1)","v":8},{"$f":"IF(OR(MID($B12, L13+1,2)=\"NJ\",MID($B12, L13+1,2)=\"LJ\",MID($B12, L13+1,2)=\"DŽ\"),L13+2,L13+1)","v":9},{"$f":"IF(OR(MID($B12, M13+1,2)=\"NJ\",MID($B12, M13+1,2)=\"LJ\",MID($B12, M13+1,2)=\"DŽ\"),M13+2,M13+1)","v":10},{"$f":"IF(OR(MID($B12, N13+1,2)=\"NJ\",MID($B12, N13+1,2)=\"LJ\",MID($B12, N13+1,2)=\"DŽ\"),N13+2,N13+1)","v":11},{"$f":"IF(OR(MID($B12, O13+1,2)=\"NJ\",MID($B12, O13+1,2)=\"LJ\",MID($B12, O13+1,2)=\"DŽ\"),O13+2,O13+1)","v":12},{"$f":"IF(OR(MID($B12, P13+1,2)=\"NJ\",MID($B12, P13+1,2)=\"LJ\",MID($B12, P13+1,2)=\"DŽ\"),P13+2,P13+1)","v":13},{"$f":"IF(OR(MID($B12, Q13+1,2)=\"NJ\",MID($B12, Q13+1,2)=\"LJ\",MID($B12, Q13+1,2)=\"DŽ\"),Q13+2,Q13+1)","v":14},{"$f":"IF(OR(MID($B12, R13+1,2)=\"NJ\",MID($B12, R13+1,2)=\"LJ\",MID($B12, R13+1,2)=\"DŽ\"),R13+2,R13+1)","v":15},{"$f":"IF(OR(MID($B12, S13+1,2)=\"NJ\",MID($B12, S13+1,2)=\"LJ\",MID($B12, S13+1,2)=\"DŽ\"),S13+2,S13+1)","v":16},{"$f":"IF(OR(MID($B12, T13+1,2)=\"NJ\",MID($B12, T13+1,2)=\"LJ\",MID($B12, T13+1,2)=\"DŽ\"),T13+2,T13+1)","v":17},{"$f":"IF(OR(MID($B12, U13+1,2)=\"NJ\",MID($B12, U13+1,2)=\"LJ\",MID($B12, U13+1,2)=\"DŽ\"),U13+2,U13+1)","v":18},{"$f":"IF(OR(MID($B12, V13+1,2)=\"NJ\",MID($B12, V13+1,2)=\"LJ\",MID($B12, V13+1,2)=\"DŽ\"),V13+2,V13+1)","v":19},{"$f":"IF(OR(MID($B12, W13+1,2)=\"NJ\",MID($B12, W13+1,2)=\"LJ\",MID($B12, W13+1,2)=\"DŽ\"),W13+2,W13+1)","v":20},{"$f":"IF(OR(MID($B12, X13+1,2)=\"NJ\",MID($B12, X13+1,2)=\"LJ\",MID($B12, X13+1,2)=\"DŽ\"),X13+2,X13+1)","v":21},{"$f":"IF(OR(MID($B12, Y13+1,2)=\"NJ\",MID($B12, Y13+1,2)=\"LJ\",MID($B12, Y13+1,2)=\"DŽ\"),Y13+2,Y13+1)","v":22},{"$f":"IF(OR(MID($B12, Z13+1,2)=\"NJ\",MID($B12, Z13+1,2)=\"LJ\",MID($B12, Z13+1,2)=\"DŽ\"),Z13+2,Z13+1)","v":23},{"$f":"IF(OR(MID($B12, AA13+1,2)=\"NJ\",MID($B12, AA13+1,2)=\"LJ\",MID($B12, AA13+1,2)=\"DŽ\"),AA13+2,AA13+1)","v":24},{"$f":"IF(OR(MID($B12, AB13+1,2)=\"NJ\",MID($B12, AB13+1,2)=\"LJ\",MID($B12, AB13+1,2)=\"DŽ\"),AB13+2,AB13+1)","v":25},{"$f":"IF(OR(MID($B12, AC13+1,2)=\"NJ\",MID($B12, AC13+1,2)=\"LJ\",MID($B12, AC13+1,2)=\"DŽ\"),AC13+2,AC13+1)","v":26},{"$f":"IF(OR(MID($B12, AD13+1,2)=\"NJ\",MID($B12, AD13+1,2)=\"LJ\",MID($B12, AD13+1,2)=\"DŽ\"),AD13+2,AD13+1)","v":27},{"$f":"IF(OR(MID($B12, AE13+1,2)=\"NJ\",MID($B12, AE13+1,2)=\"LJ\",MID($B12, AE13+1,2)=\"DŽ\"),AE13+2,AE13+1)","v":28},{"$f":"IF(OR(MID($B12, AF13+1,2)=\"NJ\",MID($B12, AF13+1,2)=\"LJ\",MID($B12, AF13+1,2)=\"DŽ\"),AF13+2,AF13+1)","v":29},{"$f":"IF(OR(MID($B12, AG13+1,2)=\"NJ\",MID($B12, AG13+1,2)=\"LJ\",MID($B12, AG13+1,2)=\"DŽ\"),AG13+2,AG13+1)","v":30},{"$f":"IF(OR(MID($B12, AH13+1,2)=\"NJ\",MID($B12, AH13+1,2)=\"LJ\",MID($B12, AH13+1,2)=\"DŽ\"),AH13+2,AH13+1)","v":31},{"$f":"IF(OR(MID($B12, AI13+1,2)=\"NJ\",MID($B12, AI13+1,2)=\"LJ\",MID($B12, AI13+1,2)=\"DŽ\"),AI13+2,AI13+1)","v":32},{"$f":"IF(OR(MID($B12, AJ13+1,2)=\"NJ\",MID($B12, AJ13+1,2)=\"LJ\",MID($B12, AJ13+1,2)=\"DŽ\"),AJ13+2,AJ13+1)","v":33},{"$f":"IF(OR(MID($B12, AK13+1,2)=\"NJ\",MID($B12, AK13+1,2)=\"LJ\",MID($B12, AK13+1,2)=\"DŽ\"),AK13+2,AK13+1)","v":34},{"$f":"IF(OR(MID($B12, AL13+1,2)=\"NJ\",MID($B12, AL13+1,2)=\"LJ\",MID($B12, AL13+1,2)=\"DŽ\"),AL13+2,AL13+1)","v":35},{"$f":"IF(OR(MID($B12, AM13+1,2)=\"NJ\",MID($B12, AM13+1,2)=\"LJ\",MID($B12, AM13+1,2)=\"DŽ\"),AM13+2,AM13+1)","v":36},{"$f":"IF(OR(MID($B12, AN13+1,2)=\"NJ\",MID($B12, AN13+1,2)=\"LJ\",MID($B12, AN13+1,2)=\"DŽ\"),AN13+2,AN13+1)","v":37},{"$f":"IF(OR(MID($B12, AO13+1,2)=\"NJ\",MID($B12, AO13+1,2)=\"LJ\",MID($B12, AO13+1,2)=\"DŽ\"),AO13+2,AO13+1)","v":38},{"$f":"IF(OR(MID($B12, AP13+1,2)=\"NJ\",MID($B12, AP13+1,2)=\"LJ\",MID($B12, AP13+1,2)=\"DŽ\"),AP13+2,AP13+1)","v":39},{"$f":"IF(OR(MID($B12, AQ13+1,2)=\"NJ\",MID($B12, AQ13+1,2)=\"LJ\",MID($B12, AQ13+1,2)=\"DŽ\"),AQ13+2,AQ13+1)","v":40},{"$f":"IF(OR(MID($B12, AR13+1,2)=\"NJ\",MID($B12, AR13+1,2)=\"LJ\",MID($B12, AR13+1,2)=\"DŽ\"),AR13+2,AR13+1)","v":41},{"$f":"IF(OR(MID($B12, AS13+1,2)=\"NJ\",MID($B12, AS13+1,2)=\"LJ\",MID($B12, AS13+1,2)=\"DŽ\"),AS13+2,AS13+1)","v":42},{"$f":"IF(OR(MID($B12, AT13+1,2)=\"NJ\",MID($B12, AT13+1,2)=\"LJ\",MID($B12, AT13+1,2)=\"DŽ\"),AT13+2,AT13+1)","v":43},{"$f":"IF(OR(MID($B12, AU13+1,2)=\"NJ\",MID($B12, AU13+1,2)=\"LJ\",MID($B12, AU13+1,2)=\"DŽ\"),AU13+2,AU13+1)","v":44},{"$f":"IF(OR(MID($B12, AV13+1,2)=\"NJ\",MID($B12, AV13+1,2)=\"LJ\",MID($B12, AV13+1,2)=\"DŽ\"),AV13+2,AV13+1)","v":45},{"$f":"IF(OR(MID($B12, AW13+1,2)=\"NJ\",MID($B12, AW13+1,2)=\"LJ\",MID($B12, AW13+1,2)=\"DŽ\"),AW13+2,AW13+1)","v":46},{"$f":"IF(OR(MID($B12, AX13+1,2)=\"NJ\",MID($B12, AX13+1,2)=\"LJ\",MID($B12, AX13+1,2)=\"DŽ\"),AX13+2,AX13+1)","v":47},{"$f":"IF(OR(MID($B12, AY13+1,2)=\"NJ\",MID($B12, AY13+1,2)=\"LJ\",MID($B12, AY13+1,2)=\"DŽ\"),AY13+2,AY13+1)","v":48},{"$f":"IF(OR(MID($B12, AZ13+1,2)=\"NJ\",MID($B12, AZ13+1,2)=\"LJ\",MID($B12, AZ13+1,2)=\"DŽ\"),AZ13+2,AZ13+1)","v":49},{"$f":"IF(OR(MID($B12, BA13+1,2)=\"NJ\",MID($B12, BA13+1,2)=\"LJ\",MID($B12, BA13+1,2)=\"DŽ\"),BA13+2,BA13+1)","v":50},{"$f":"IF(OR(MID($B12, BB13+1,2)=\"NJ\",MID($B12, BB13+1,2)=\"LJ\",MID($B12, BB13+1,2)=\"DŽ\"),BB13+2,BB13+1)","v":51},{"$f":"IF(OR(MID($B12, BC13+1,2)=\"NJ\",MID($B12, BC13+1,2)=\"LJ\",MID($B12, BC13+1,2)=\"DŽ\"),BC13+2,BC13+1)","v":52},{"$f":"IF(OR(MID($B12, BD13+1,2)=\"NJ\",MID($B12, BD13+1,2)=\"LJ\",MID($B12, BD13+1,2)=\"DŽ\"),BD13+2,BD13+1)","v":53},{"$f":"IF(OR(MID($B12, BE13+1,2)=\"NJ\",MID($B12, BE13+1,2)=\"LJ\",MID($B12, BE13+1,2)=\"DŽ\"),BE13+2,BE13+1)","v":54},{"$f":"IF(OR(MID($B12, BF13+1,2)=\"NJ\",MID($B12, BF13+1,2)=\"LJ\",MID($B12, BF13+1,2)=\"DŽ\"),BF13+2,BF13+1)","v":55},{"$f":"IF(OR(MID($B12, BG13+1,2)=\"NJ\",MID($B12, BG13+1,2)=\"LJ\",MID($B12, BG13+1,2)=\"DŽ\"),BG13+2,BG13+1)","v":56},{"$f":"IF(OR(MID($B12, BH13+1,2)=\"NJ\",MID($B12, BH13+1,2)=\"LJ\",MID($B12, BH13+1,2)=\"DŽ\"),BH13+2,BH13+1)","v":57},{"$f":"IF(OR(MID($B12, BI13+1,2)=\"NJ\",MID($B12, BI13+1,2)=\"LJ\",MID($B12, BI13+1,2)=\"DŽ\"),BI13+2,BI13+1)","v":58},{"$f":"IF(OR(MID($B12, BJ13+1,2)=\"NJ\",MID($B12, BJ13+1,2)=\"LJ\",MID($B12, BJ13+1,2)=\"DŽ\"),BJ13+2,BJ13+1)","v":59},{"$f":"IF(OR(MID($B12, BK13+1,2)=\"NJ\",MID($B12, BK13+1,2)=\"LJ\",MID($B12, BK13+1,2)=\"DŽ\"),BK13+2,BK13+1)","v":60},{"$f":"IF(OR(MID($B12, BL13+1,2)=\"NJ\",MID($B12, BL13+1,2)=\"LJ\",MID($B12, BL13+1,2)=\"DŽ\"),BL13+2,BL13+1)","v":61},{"$f":"IF(OR(MID($B12, BM13+1,2)=\"NJ\",MID($B12, BM13+1,2)=\"LJ\",MID($B12, BM13+1,2)=\"DŽ\"),BM13+2,BM13+1)","v":62},{"$f":"IF(OR(MID($B12, BN13+1,2)=\"NJ\",MID($B12, BN13+1,2)=\"LJ\",MID($B12, BN13+1,2)=\"DŽ\"),BN13+2,BN13+1)","v":63},{"$f":"IF(OR(MID($B12, BO13+1,2)=\"NJ\",MID($B12, BO13+1,2)=\"LJ\",MID($B12, BO13+1,2)=\"DŽ\"),BO13+2,BO13+1)","v":64},{"$f":"IF(OR(MID($B12, BP13+1,2)=\"NJ\",MID($B12, BP13+1,2)=\"LJ\",MID($B12, BP13+1,2)=\"DŽ\"),BP13+2,BP13+1)","v":65},{"$f":"IF(OR(MID($B12, BQ13+1,2)=\"NJ\",MID($B12, BQ13+1,2)=\"LJ\",MID($B12, BQ13+1,2)=\"DŽ\"),BQ13+2,BQ13+1)","v":66},{"$f":"IF(OR(MID($B12, BR13+1,2)=\"NJ\",MID($B12, BR13+1,2)=\"LJ\",MID($B12, BR13+1,2)=\"DŽ\"),BR13+2,BR13+1)","v":67},{"$f":"IF(OR(MID($B12, BS13+1,2)=\"NJ\",MID($B12, BS13+1,2)=\"LJ\",MID($B12, BS13+1,2)=\"DŽ\"),BS13+2,BS13+1)","v":68},{"$f":"IF(OR(MID($B12, BT13+1,2)=\"NJ\",MID($B12, BT13+1,2)=\"LJ\",MID($B12, BT13+1,2)=\"DŽ\"),BT13+2,BT13+1)","v":70},{"$f":"IF(OR(MID($B12, BU13+1,2)=\"NJ\",MID($B12, BU13+1,2)=\"LJ\",MID($B12, BU13+1,2)=\"DŽ\"),BU13+2,BU13+1)","v":71}]
[7,"5 + 7 = 12",10,7,{"$f":"IF(OR(LEFT(B14, 2) =\"NJ\", LEFT(B14, 2) =\"LJ\", LEFT(B14, 2) =\"DŽ\"), LEFT(B14, 2), LEFT(B14, 1))","v":"5"},{"$f":"IF(OR(MID($B14, E15+1,2) =\"NJ\", MID($B14, E15+1,2) =\"LJ\", MID($B14, E15+1,2) =\"DŽ\"), MID($B14, E15+1,2),MID($B14, E15+1,1))","v":" "},"+"," ","7"," ","="," ","1","2","","","","","","","","","","","","","","","","","","","","","","","","","","","","","","","","","","","","","","","","","","","","","","","","","","","","","","","","","","","",""]
[null,null,null,null,{"$f":"IF(OR(LEFT(B14, 2) =\"NJ\", LEFT(B14, 2) =\"LJ\", LEFT(B14, 2) =\"DŽ\"),2,1)","v":1},{"$f":"IF(OR(MID($B14, E15+1,2)=\"NJ\",MID($B14, E15+1,2)=\"LJ\",MID($B14, E15+1,2)=\"DŽ\"),E15+2,E15+1)","v":2},{"$f":"IF(OR(MID($B14, F15+1,2)=\"NJ\",MID($B14, F15+1,2)=\"LJ\",MID($B14, F15+1,2)=\"DŽ\"),F15+2,F15+1)","v":3},{"$f":"IF(OR(MID($B14, G15+1,2)=\"NJ\",MID($B14, G15+1,2)=\"LJ\",MID($B14, G15+1,2)=\"DŽ\"),G15+2,G15+1)","v":4},{"$f":"IF(OR(MID($B14, H15+1,2)=\"NJ\",MID($B14, H15+1,2)=\"LJ\",MID($B14, H15+1,2)=\"DŽ\"),H15+2,H15+1)","v":5},{"$f":"IF(OR(MID($B14, I15+1,2)=\"NJ\",MID($B14, I15+1,2)=\"LJ\",MID($B14, I15+1,2)=\"DŽ\"),I15+2,I15+1)","v":6},{"$f":"IF(OR(MID($B14, J15+1,2)=\"NJ\",MID($B14, J15+1,2)=\"LJ\",MID($B14, J15+1,2)=\"DŽ\"),J15+2,J15+1)","v":7},{"$f":"IF(OR(MID($B14, K15+1,2)=\"NJ\",MID($B14, K15+1,2)=\"LJ\",MID($B14, K15+1,2)=\"DŽ\"),K15+2,K15+1)","v":8},{"$f":"IF(OR(MID($B14, L15+1,2)=\"NJ\",MID($B14, L15+1,2)=\"LJ\",MID($B14, L15+1,2)=\"DŽ\"),L15+2,L15+1)","v":9},{"$f":"IF(OR(MID($B14, M15+1,2)=\"NJ\",MID($B14, M15+1,2)=\"LJ\",MID($B14, M15+1,2)=\"DŽ\"),M15+2,M15+1)","v":10},{"$f":"IF(OR(MID($B14, N15+1,2)=\"NJ\",MID($B14, N15+1,2)=\"LJ\",MID($B14, N15+1,2)=\"DŽ\"),N15+2,N15+1)","v":11},{"$f":"IF(OR(MID($B14, O15+1,2)=\"NJ\",MID($B14, O15+1,2)=\"LJ\",MID($B14, O15+1,2)=\"DŽ\"),O15+2,O15+1)","v":12},{"$f":"IF(OR(MID($B14, P15+1,2)=\"NJ\",MID($B14, P15+1,2)=\"LJ\",MID($B14, P15+1,2)=\"DŽ\"),P15+2,P15+1)","v":13},{"$f":"IF(OR(MID($B14, Q15+1,2)=\"NJ\",MID($B14, Q15+1,2)=\"LJ\",MID($B14, Q15+1,2)=\"DŽ\"),Q15+2,Q15+1)","v":14},{"$f":"IF(OR(MID($B14, R15+1,2)=\"NJ\",MID($B14, R15+1,2)=\"LJ\",MID($B14, R15+1,2)=\"DŽ\"),R15+2,R15+1)","v":15},{"$f":"IF(OR(MID($B14, S15+1,2)=\"NJ\",MID($B14, S15+1,2)=\"LJ\",MID($B14, S15+1,2)=\"DŽ\"),S15+2,S15+1)","v":16},{"$f":"IF(OR(MID($B14, T15+1,2)=\"NJ\",MID($B14, T15+1,2)=\"LJ\",MID($B14, T15+1,2)=\"DŽ\"),T15+2,T15+1)","v":17},{"$f":"IF(OR(MID($B14, U15+1,2)=\"NJ\",MID($B14, U15+1,2)=\"LJ\",MID($B14, U15+1,2)=\"DŽ\"),U15+2,U15+1)","v":18},{"$f":"IF(OR(MID($B14, V15+1,2)=\"NJ\",MID($B14, V15+1,2)=\"LJ\",MID($B14, V15+1,2)=\"DŽ\"),V15+2,V15+1)","v":19},{"$f":"IF(OR(MID($B14, W15+1,2)=\"NJ\",MID($B14, W15+1,2)=\"LJ\",MID($B14, W15+1,2)=\"DŽ\"),W15+2,W15+1)","v":20},{"$f":"IF(OR(MID($B14, X15+1,2)=\"NJ\",MID($B14, X15+1,2)=\"LJ\",MID($B14, X15+1,2)=\"DŽ\"),X15+2,X15+1)","v":21},{"$f":"IF(OR(MID($B14, Y15+1,2)=\"NJ\",MID($B14, Y15+1,2)=\"LJ\",MID($B14, Y15+1,2)=\"DŽ\"),Y15+2,Y15+1)","v":22},{"$f":"IF(OR(MID($B14, Z15+1,2)=\"NJ\",MID($B14, Z15+1,2)=\"LJ\",MID($B14, Z15+1,2)=\"DŽ\"),Z15+2,Z15+1)","v":23},{"$f":"IF(OR(MID($B14, AA15+1,2)=\"NJ\",MID($B14, AA15+1,2)=\"LJ\",MID($B14, AA15+1,2)=\"DŽ\"),AA15+2,AA15+1)","v":24},{"$f":"IF(OR(MID($B14, AB15+1,2)=\"NJ\",MID($B14, AB15+1,2)=\"LJ\",MID($B14, AB15+1,2)=\"DŽ\"),AB15+2,AB15+1)","v":25},{"$f":"IF(OR(MID($B14, AC15+1,2)=\"NJ\",MID($B14, AC15+1,2)=\"LJ\",MID($B14, AC15+1,2)=\"DŽ\"),AC15+2,AC15+1)","v":26},{"$f":"IF(OR(MID($B14, AD15+1,2)=\"NJ\",MID($B14, AD15+1,2)=\"LJ\",MID($B14, AD15+1,2)=\"DŽ\"),AD15+2,AD15+1)","v":27},{"$f":"IF(OR(MID($B14, AE15+1,2)=\"NJ\",MID($B14, AE15+1,2)=\"LJ\",MID($B14, AE15+1,2)=\"DŽ\"),AE15+2,AE15+1)","v":28},{"$f":"IF(OR(MID($B14, AF15+1,2)=\"NJ\",MID($B14, AF15+1,2)=\"LJ\",MID($B14, AF15+1,2)=\"DŽ\"),AF15+2,AF15+1)","v":29},{"$f":"IF(OR(MID($B14, AG15+1,2)=\"NJ\",MID($B14, AG15+1,2)=\"LJ\",MID($B14, AG15+1,2)=\"DŽ\"),AG15+2,AG15+1)","v":30},{"$f":"IF(OR(MID($B14, AH15+1,2)=\"NJ\",MID($B14, AH15+1,2)=\"LJ\",MID($B14, AH15+1,2)=\"DŽ\"),AH15+2,AH15+1)","v":31},{"$f":"IF(OR(MID($B14, AI15+1,2)=\"NJ\",MID($B14, AI15+1,2)=\"LJ\",MID($B14, AI15+1,2)=\"DŽ\"),AI15+2,AI15+1)","v":32},{"$f":"IF(OR(MID($B14, AJ15+1,2)=\"NJ\",MID($B14, AJ15+1,2)=\"LJ\",MID($B14, AJ15+1,2)=\"DŽ\"),AJ15+2,AJ15+1)","v":33},{"$f":"IF(OR(MID($B14, AK15+1,2)=\"NJ\",MID($B14, AK15+1,2)=\"LJ\",MID($B14, AK15+1,2)=\"DŽ\"),AK15+2,AK15+1)","v":34},{"$f":"IF(OR(MID($B14, AL15+1,2)=\"NJ\",MID($B14, AL15+1,2)=\"LJ\",MID($B14, AL15+1,2)=\"DŽ\"),AL15+2,AL15+1)","v":35},{"$f":"IF(OR(MID($B14, AM15+1,2)=\"NJ\",MID($B14, AM15+1,2)=\"LJ\",MID($B14, AM15+1,2)=\"DŽ\"),AM15+2,AM15+1)","v":36},{"$f":"IF(OR(MID($B14, AN15+1,2)=\"NJ\",MID($B14, AN15+1,2)=\"LJ\",MID($B14, AN15+1,2)=\"DŽ\"),AN15+2,AN15+1)","v":37},{"$f":"IF(OR(MID($B14, AO15+1,2)=\"NJ\",MID($B14, AO15+1,2)=\"LJ\",MID($B14, AO15+1,2)=\"DŽ\"),AO15+2,AO15+1)","v":38},{"$f":"IF(OR(MID($B14, AP15+1,2)=\"NJ\",MID($B14, AP15+1,2)=\"LJ\",MID($B14, AP15+1,2)=\"DŽ\"),AP15+2,AP15+1)","v":39},{"$f":"IF(OR(MID($B14, AQ15+1,2)=\"NJ\",MID($B14, AQ15+1,2)=\"LJ\",MID($B14, AQ15+1,2)=\"DŽ\"),AQ15+2,AQ15+1)","v":40},{"$f":"IF(OR(MID($B14, AR15+1,2)=\"NJ\",MID($B14, AR15+1,2)=\"LJ\",MID($B14, AR15+1,2)=\"DŽ\"),AR15+2,AR15+1)","v":41},{"$f":"IF(OR(MID($B14, AS15+1,2)=\"NJ\",MID($B14, AS15+1,2)=\"LJ\",MID($B14, AS15+1,2)=\"DŽ\"),AS15+2,AS15+1)","v":42},{"$f":"IF(OR(MID($B14, AT15+1,2)=\"NJ\",MID($B14, AT15+1,2)=\"LJ\",MID($B14, AT15+1,2)=\"DŽ\"),AT15+2,AT15+1)","v":43},{"$f":"IF(OR(MID($B14, AU15+1,2)=\"NJ\",MID($B14, AU15+1,2)=\"LJ\",MID($B14, AU15+1,2)=\"DŽ\"),AU15+2,AU15+1)","v":44},{"$f":"IF(OR(MID($B14, AV15+1,2)=\"NJ\",MID($B14, AV15+1,2)=\"LJ\",MID($B14, AV15+1,2)=\"DŽ\"),AV15+2,AV15+1)","v":45},{"$f":"IF(OR(MID($B14, AW15+1,2)=\"NJ\",MID($B14, AW15+1,2)=\"LJ\",MID($B14, AW15+1,2)=\"DŽ\"),AW15+2,AW15+1)","v":46},{"$f":"IF(OR(MID($B14, AX15+1,2)=\"NJ\",MID($B14, AX15+1,2)=\"LJ\",MID($B14, AX15+1,2)=\"DŽ\"),AX15+2,AX15+1)","v":47},{"$f":"IF(OR(MID($B14, AY15+1,2)=\"NJ\",MID($B14, AY15+1,2)=\"LJ\",MID($B14, AY15+1,2)=\"DŽ\"),AY15+2,AY15+1)","v":48},{"$f":"IF(OR(MID($B14, AZ15+1,2)=\"NJ\",MID($B14, AZ15+1,2)=\"LJ\",MID($B14, AZ15+1,2)=\"DŽ\"),AZ15+2,AZ15+1)","v":49},{"$f":"IF(OR(MID($B14, BA15+1,2)=\"NJ\",MID($B14, BA15+1,2)=\"LJ\",MID($B14, BA15+1,2)=\"DŽ\"),BA15+2,BA15+1)","v":50},{"$f":"IF(OR(MID($B14, BB15+1,2)=\"NJ\",MID($B14, BB15+1,2)=\"LJ\",MID($B14, BB15+1,2)=\"DŽ\"),BB15+2,BB15+1)","v":51},{"$f":"IF(OR(MID($B14, BC15+1,2)=\"NJ\",MID($B14, BC15+1,2)=\"LJ\",MID($B14, BC15+1,2)=\"DŽ\"),BC15+2,BC15+1)","v":52},{"$f":"IF(OR(MID($B14, BD15+1,2)=\"NJ\",MID($B14, BD15+1,2)=\"LJ\",MID($B14, BD15+1,2)=\"DŽ\"),BD15+2,BD15+1)","v":53},{"$f":"IF(OR(MID($B14, BE15+1,2)=\"NJ\",MID($B14, BE15+1,2)=\"LJ\",MID($B14, BE15+1,2)=\"DŽ\"),BE15+2,BE15+1)","v":54},{"$f":"IF(OR(MID($B14, BF15+1,2)=\"NJ\",MID($B14, BF15+1,2)=\"LJ\",MID($B14, BF15+1,2)=\"DŽ\"),BF15+2,BF15+1)","v":55},{"$f":"IF(OR(MID($B14, BG15+1,2)=\"NJ\",MID($B14, BG15+1,2)=\"LJ\",MID($B14, BG15+1,2)=\"DŽ\"),BG15+2,BG15+1)","v":56},{"$f":"IF(OR(MID($B14, BH15+1,2)=\"NJ\",MID($B14, BH15+1,2)=\"LJ\",MID($B14, BH15+1,2)=\"DŽ\"),BH15+2,BH15+1)","v":57},{"$f":"IF(OR(MID($B14, BI15+1,2)=\"NJ\",MID($B14, BI15+1,2)=\"LJ\",MID($B14, BI15+1,2)=\"DŽ\"),BI15+2,BI15+1)","v":58},{"$f":"IF(OR(MID($B14, BJ15+1,2)=\"NJ\",MID($B14, BJ15+1,2)=\"LJ\",MID($B14, BJ15+1,2)=\"DŽ\"),BJ15+2,BJ15+1)","v":59},{"$f":"IF(OR(MID($B14, BK15+1,2)=\"NJ\",MID($B14, BK15+1,2)=\"LJ\",MID($B14, BK15+1,2)=\"DŽ\"),BK15+2,BK15+1)","v":60},{"$f":"IF(OR(MID($B14, BL15+1,2)=\"NJ\",MID($B14, BL15+1,2)=\"LJ\",MID($B14, BL15+1,2)=\"DŽ\"),BL15+2,BL15+1)","v":61},{"$f":"IF(OR(MID($B14, BM15+1,2)=\"NJ\",MID($B14, BM15+1,2)=\"LJ\",MID($B14, BM15+1,2)=\"DŽ\"),BM15+2,BM15+1)","v":62},{"$f":"IF(OR(MID($B14, BN15+1,2)=\"NJ\",MID($B14, BN15+1,2)=\"LJ\",MID($B14, BN15+1,2)=\"DŽ\"),BN15+2,BN15+1)","v":63},{"$f":"IF(OR(MID($B14, BO15+1,2)=\"NJ\",MID($B14, BO15+1,2)=\"LJ\",MID($B14, BO15+1,2)=\"DŽ\"),BO15+2,BO15+1)","v":64},{"$f":"IF(OR(MID($B14, BP15+1,2)=\"NJ\",MID($B14, BP15+1,2)=\"LJ\",MID($B14, BP15+1,2)=\"DŽ\"),BP15+2,BP15+1)","v":65},{"$f":"IF(OR(MID($B14, BQ15+1,2)=\"NJ\",MID($B14, BQ15+1,2)=\"LJ\",MID($B14, BQ15+1,2)=\"DŽ\"),BQ15+2,BQ15+1)","v":66},{"$f":"IF(OR(MID($B14, BR15+1,2)=\"NJ\",MID($B14, BR15+1,2)=\"LJ\",MID($B14, BR15+1,2)=\"DŽ\"),BR15+2,BR15+1)","v":67},{"$f":"IF(OR(MID($B14, BS15+1,2)=\"NJ\",MID($B14, BS15+1,2)=\"LJ\",MID($B14, BS15+1,2)=\"DŽ\"),BS15+2,BS15+1)","v":68},{"$f":"IF(OR(MID($B14, BT15+1,2)=\"NJ\",MID($B14, BT15+1,2)=\"LJ\",MID($B14, BT15+1,2)=\"DŽ\"),BT15+2,BT15+1)","v":69},{"$f":"IF(OR(MID($B14, BU15+1,2)=\"NJ\",MID($B14, BU15+1,2)=\"LJ\",MID($B14, BU15+1,2)=\"DŽ\"),BU15+2,BU15+1)","v":70}]
[8,"I cvrči, cvrči cvrčak na čvoru crne smrče",41,8,{"$f":"IF(OR(LEFT(B16, 2) =\"NJ\", LEFT(B16, 2) =\"LJ\", LEFT(B16, 2) =\"DŽ\"), LEFT(B16, 2), LEFT(B16, 1))","v":"I"},{"$f":"IF(OR(MID($B16, E17+1,2) =\"NJ\", MID($B16, E17+1,2) =\"LJ\", MID($B16, E17+1,2) =\"DŽ\"), MID($B16, E17+1,2),MID($B16, E17+1,1))","v":" "},"c","v","r","č","i",","," ","c","v","r","č","i"," ","c","v","r","č","a","k"," ","n","a"," ","č","v","o","r","u"," ","c","r","n","e"," ","s","m","r","č","e","","","","","","","","","","","","","","","","","","","","","","","","","","","","",""]
[null,null,null,null,{"$f":"IF(OR(LEFT(B16, 2) =\"NJ\", LEFT(B16, 2) =\"LJ\", LEFT(B16, 2) =\"DŽ\"),2,1)","v":1},{"$f":"IF(OR(MID($B16, E17+1,2)=\"NJ\",MID($B16, E17+1,2)=\"LJ\",MID($B16, E17+1,2)=\"DŽ\"),E17+2,E17+1)","v":2},{"$f":"IF(OR(MID($B16, F17+1,2)=\"NJ\",MID($B16, F17+1,2)=\"LJ\",MID($B16, F17+1,2)=\"DŽ\"),F17+2,F17+1)","v":3},{"$f":"IF(OR(MID($B16, G17+1,2)=\"NJ\",MID($B16, G17+1,2)=\"LJ\",MID($B16, G17+1,2)=\"DŽ\"),G17+2,G17+1)","v":4},{"$f":"IF(OR(MID($B16, H17+1,2)=\"NJ\",MID($B16, H17+1,2)=\"LJ\",MID($B16, H17+1,2)=\"DŽ\"),H17+2,H17+1)","v":5},{"$f":"IF(OR(MID($B16, I17+1,2)=\"NJ\",MID($B16, I17+1,2)=\"LJ\",MID($B16, I17+1,2)=\"DŽ\"),I17+2,I17+1)","v":6},{"$f":"IF(OR(MID($B16, J17+1,2)=\"NJ\",MID($B16, J17+1,2)=\"LJ\",MID($B16, J17+1,2)=\"DŽ\"),J17+2,J17+1)","v":7},{"$f":"IF(OR(MID($B16, K17+1,2)=\"NJ\",MID($B16, K17+1,2)=\"LJ\",MID($B16, K17+1,2)=\"DŽ\"),K17+2,K17+1)","v":8},{"$f":"IF(OR(MID($B16, L17+1,2)=\"NJ\",MID($B16, L17+1,2)=\"LJ\",MID($B16, L17+1,2)=\"DŽ\"),L17+2,L17+1)","v":9},{"$f":"IF(OR(MID($B16, M17+1,2)=\"NJ\",MID($B16, M17+1,2)=\"LJ\",MID($B16, M17+1,2)=\"DŽ\"),M17+2,M17+1)","v":10},{"$f":"IF(OR(MID($B16, N17+1,2)=\"NJ\",MID($B16, N17+1,2)=\"LJ\",MID($B16, N17+1,2)=\"DŽ\"),N17+2,N17+1)","v":11},{"$f":"IF(OR(MID($B16, O17+1,2)=\"NJ\",MID($B16, O17+1,2)=\"LJ\",MID($B16, O17+1,2)=\"DŽ\"),O17+2,O17+1)","v":12},{"$f":"IF(OR(MID($B16, P17+1,2)=\"NJ\",MID($B16, P17+1,2)=\"LJ\",MID($B16, P17+1,2)=\"DŽ\"),P17+2,P17+1)","v":13},{"$f":"IF(OR(MID($B16, Q17+1,2)=\"NJ\",MID($B16, Q17+1,2)=\"LJ\",MID($B16, Q17+1,2)=\"DŽ\"),Q17+2,Q17+1)","v":14},{"$f":"IF(OR(MID($B16, R17+1,2)=\"NJ\",MID($B16, R17+1,2)=\"LJ\",MID($B16, R17+1,2)=\"DŽ\"),R17+2,R17+1)","v":15},{"$f":"IF(OR(MID($B16, S17+1,2)=\"NJ\",MID($B16, S17+1,2)=\"LJ\",MID($B16, S17+1,2)=\"DŽ\"),S17+2,S17+1)","v":16},{"$f":"IF(OR(MID($B16, T17+1,2)=\"NJ\",MID($B16, T17+1,2)=\"LJ\",MID($B16, T17+1,2)=\"DŽ\"),T17+2,T17+1)","v":17},{"$f":"IF(OR(MID($B16, U17+1,2)=\"NJ\",MID($B16, U17+1,2)=\"LJ\",MID($B16, U17+1,2)=\"DŽ\"),U17+2,U17+1)","v":18},{"$f":"IF(OR(MID($B16, V17+1,2)=\"NJ\",MID($B16, V17+1,2)=\"LJ\",MID($B16, V17+1,2)=\"DŽ\"),V17+2,V17+1)","v":19},{"$f":"IF(OR(MID($B16, W17+1,2)=\"NJ\",MID($B16, W17+1,2)=\"LJ\",MID($B16, W17+1,2)=\"DŽ\"),W17+2,W17+1)","v":20},{"$f":"IF(OR(MID($B16, X17+1,2)=\"NJ\",MID($B16, X17+1,2)=\"LJ\",MID($B16, X17+1,2)=\"DŽ\"),X17+2,X17+1)","v":21},{"$f":"IF(OR(MID($B16, Y17+1,2)=\"NJ\",MID($B16, Y17+1,2)=\"LJ\",MID($B16, Y17+1,2)=\"DŽ\"),Y17+2,Y17+1)","v":22},{"$f":"IF(OR(MID($B16, Z17+1,2)=\"NJ\",MID($B16, Z17+1,2)=\"LJ\",MID($B16, Z17+1,2)=\"DŽ\"),Z17+2,Z17+1)","v":23},{"$f":"IF(OR(MID($B16, AA17+1,2)=\"NJ\",MID($B16, AA17+1,2)=\"LJ\",MID($B16, AA17+1,2)=\"DŽ\"),AA17+2,AA17+1)","v":24},{"$f":"IF(OR(MID($B16, AB17+1,2)=\"NJ\",MID($B16, AB17+1,2)=\"LJ\",MID($B16, AB17+1,2)=\"DŽ\"),AB17+2,AB17+1)","v":25},{"$f":"IF(OR(MID($B16, AC17+1,2)=\"NJ\",MID($B16, AC17+1,2)=\"LJ\",MID($B16, AC17+1,2)=\"DŽ\"),AC17+2,AC17+1)","v":26},{"$f":"IF(OR(MID($B16, AD17+1,2)=\"NJ\",MID($B16, AD17+1,2)=\"LJ\",MID($B16, AD17+1,2)=\"DŽ\"),AD17+2,AD17+1)","v":27},{"$f":"IF(OR(MID($B16, AE17+1,2)=\"NJ\",MID($B16, AE17+1,2)=\"LJ\",MID($B16, AE17+1,2)=\"DŽ\"),AE17+2,AE17+1)","v":28},{"$f":"IF(OR(MID($B16, AF17+1,2)=\"NJ\",MID($B16, AF17+1,2)=\"LJ\",MID($B16, AF17+1,2)=\"DŽ\"),AF17+2,AF17+1)","v":29},{"$f":"IF(OR(MID($B16, AG17+1,2)=\"NJ\",MID($B16, AG17+1,2)=\"LJ\",MID($B16, AG17+1,2)=\"DŽ\"),AG17+2,AG17+1)","v":30},{"$f":"IF(OR(MID($B16, AH17+1,2)=\"NJ\",MID($B16, AH17+1,2)=\"LJ\",MID($B16, AH17+1,2)=\"DŽ\"),AH17+2,AH17+1)","v":31},{"$f":"IF(OR(MID($B16, AI17+1,2)=\"NJ\",MID($B16, AI17+1,2)=\"LJ\",MID($B16, AI17+1,2)=\"DŽ\"),AI17+2,AI17+1)","v":32},{"$f":"IF(OR(MID($B16, AJ17+1,2)=\"NJ\",MID($B16, AJ17+1,2)=\"LJ\",MID($B16, AJ17+1,2)=\"DŽ\"),AJ17+2,AJ17+1)","v":33},{"$f":"IF(OR(MID($B16, AK17+1,2)=\"NJ\",MID($B16, AK17+1,2)=\"LJ\",MID($B16, AK17+1,2)=\"DŽ\"),AK17+2,AK17+1)","v":34},{"$f":"IF(OR(MID($B16, AL17+1,2)=\"NJ\",MID($B16, AL17+1,2)=\"LJ\",MID($B16, AL17+1,2)=\"DŽ\"),AL17+2,AL17+1)","v":35},{"$f":"IF(OR(MID($B16, AM17+1,2)=\"NJ\",MID($B16, AM17+1,2)=\"LJ\",MID($B16, AM17+1,2)=\"DŽ\"),AM17+2,AM17+1)","v":36},{"$f":"IF(OR(MID($B16, AN17+1,2)=\"NJ\",MID($B16, AN17+1,2)=\"LJ\",MID($B16, AN17+1,2)=\"DŽ\"),AN17+2,AN17+1)","v":37},{"$f":"IF(OR(MID($B16, AO17+1,2)=\"NJ\",MID($B16, AO17+1,2)=\"LJ\",MID($B16, AO17+1,2)=\"DŽ\"),AO17+2,AO17+1)","v":38},{"$f":"IF(OR(MID($B16, AP17+1,2)=\"NJ\",MID($B16, AP17+1,2)=\"LJ\",MID($B16, AP17+1,2)=\"DŽ\"),AP17+2,AP17+1)","v":39},{"$f":"IF(OR(MID($B16, AQ17+1,2)=\"NJ\",MID($B16, AQ17+1,2)=\"LJ\",MID($B16, AQ17+1,2)=\"DŽ\"),AQ17+2,AQ17+1)","v":40},{"$f":"IF(OR(MID($B16, AR17+1,2)=\"NJ\",MID($B16, AR17+1,2)=\"LJ\",MID($B16, AR17+1,2)=\"DŽ\"),AR17+2,AR17+1)","v":41},{"$f":"IF(OR(MID($B16, AS17+1,2)=\"NJ\",MID($B16, AS17+1,2)=\"LJ\",MID($B16, AS17+1,2)=\"DŽ\"),AS17+2,AS17+1)","v":42},{"$f":"IF(OR(MID($B16, AT17+1,2)=\"NJ\",MID($B16, AT17+1,2)=\"LJ\",MID($B16, AT17+1,2)=\"DŽ\"),AT17+2,AT17+1)","v":43},{"$f":"IF(OR(MID($B16, AU17+1,2)=\"NJ\",MID($B16, AU17+1,2)=\"LJ\",MID($B16, AU17+1,2)=\"DŽ\"),AU17+2,AU17+1)","v":44},{"$f":"IF(OR(MID($B16, AV17+1,2)=\"NJ\",MID($B16, AV17+1,2)=\"LJ\",MID($B16, AV17+1,2)=\"DŽ\"),AV17+2,AV17+1)","v":45},{"$f":"IF(OR(MID($B16, AW17+1,2)=\"NJ\",MID($B16, AW17+1,2)=\"LJ\",MID($B16, AW17+1,2)=\"DŽ\"),AW17+2,AW17+1)","v":46},{"$f":"IF(OR(MID($B16, AX17+1,2)=\"NJ\",MID($B16, AX17+1,2)=\"LJ\",MID($B16, AX17+1,2)=\"DŽ\"),AX17+2,AX17+1)","v":47},{"$f":"IF(OR(MID($B16, AY17+1,2)=\"NJ\",MID($B16, AY17+1,2)=\"LJ\",MID($B16, AY17+1,2)=\"DŽ\"),AY17+2,AY17+1)","v":48},{"$f":"IF(OR(MID($B16, AZ17+1,2)=\"NJ\",MID($B16, AZ17+1,2)=\"LJ\",MID($B16, AZ17+1,2)=\"DŽ\"),AZ17+2,AZ17+1)","v":49},{"$f":"IF(OR(MID($B16, BA17+1,2)=\"NJ\",MID($B16, BA17+1,2)=\"LJ\",MID($B16, BA17+1,2)=\"DŽ\"),BA17+2,BA17+1)","v":50},{"$f":"IF(OR(MID($B16, BB17+1,2)=\"NJ\",MID($B16, BB17+1,2)=\"LJ\",MID($B16, BB17+1,2)=\"DŽ\"),BB17+2,BB17+1)","v":51},{"$f":"IF(OR(MID($B16, BC17+1,2)=\"NJ\",MID($B16, BC17+1,2)=\"LJ\",MID($B16, BC17+1,2)=\"DŽ\"),BC17+2,BC17+1)","v":52},{"$f":"IF(OR(MID($B16, BD17+1,2)=\"NJ\",MID($B16, BD17+1,2)=\"LJ\",MID($B16, BD17+1,2)=\"DŽ\"),BD17+2,BD17+1)","v":53},{"$f":"IF(OR(MID($B16, BE17+1,2)=\"NJ\",MID($B16, BE17+1,2)=\"LJ\",MID($B16, BE17+1,2)=\"DŽ\"),BE17+2,BE17+1)","v":54},{"$f":"IF(OR(MID($B16, BF17+1,2)=\"NJ\",MID($B16, BF17+1,2)=\"LJ\",MID($B16, BF17+1,2)=\"DŽ\"),BF17+2,BF17+1)","v":55},{"$f":"IF(OR(MID($B16, BG17+1,2)=\"NJ\",MID($B16, BG17+1,2)=\"LJ\",MID($B16, BG17+1,2)=\"DŽ\"),BG17+2,BG17+1)","v":56},{"$f":"IF(OR(MID($B16, BH17+1,2)=\"NJ\",MID($B16, BH17+1,2)=\"LJ\",MID($B16, BH17+1,2)=\"DŽ\"),BH17+2,BH17+1)","v":57},{"$f":"IF(OR(MID($B16, BI17+1,2)=\"NJ\",MID($B16, BI17+1,2)=\"LJ\",MID($B16, BI17+1,2)=\"DŽ\"),BI17+2,BI17+1)","v":58},{"$f":"IF(OR(MID($B16, BJ17+1,2)=\"NJ\",MID($B16, BJ17+1,2)=\"LJ\",MID($B16, BJ17+1,2)=\"DŽ\"),BJ17+2,BJ17+1)","v":59},{"$f":"IF(OR(MID($B16, BK17+1,2)=\"NJ\",MID($B16, BK17+1,2)=\"LJ\",MID($B16, BK17+1,2)=\"DŽ\"),BK17+2,BK17+1)","v":60},{"$f":"IF(OR(MID($B16, BL17+1,2)=\"NJ\",MID($B16, BL17+1,2)=\"LJ\",MID($B16, BL17+1,2)=\"DŽ\"),BL17+2,BL17+1)","v":61},{"$f":"IF(OR(MID($B16, BM17+1,2)=\"NJ\",MID($B16, BM17+1,2)=\"LJ\",MID($B16, BM17+1,2)=\"DŽ\"),BM17+2,BM17+1)","v":62},{"$f":"IF(OR(MID($B16, BN17+1,2)=\"NJ\",MID($B16, BN17+1,2)=\"LJ\",MID($B16, BN17+1,2)=\"DŽ\"),BN17+2,BN17+1)","v":63},{"$f":"IF(OR(MID($B16, BO17+1,2)=\"NJ\",MID($B16, BO17+1,2)=\"LJ\",MID($B16, BO17+1,2)=\"DŽ\"),BO17+2,BO17+1)","v":64},{"$f":"IF(OR(MID($B16, BP17+1,2)=\"NJ\",MID($B16, BP17+1,2)=\"LJ\",MID($B16, BP17+1,2)=\"DŽ\"),BP17+2,BP17+1)","v":65},{"$f":"IF(OR(MID($B16, BQ17+1,2)=\"NJ\",MID($B16, BQ17+1,2)=\"LJ\",MID($B16, BQ17+1,2)=\"DŽ\"),BQ17+2,BQ17+1)","v":66},{"$f":"IF(OR(MID($B16, BR17+1,2)=\"NJ\",MID($B16, BR17+1,2)=\"LJ\",MID($B16, BR17+1,2)=\"DŽ\"),BR17+2,BR17+1)","v":67},{"$f":"IF(OR(MID($B16, BS17+1,2)=\"NJ\",MID($B16, BS17+1,2)=\"LJ\",MID($B16, BS17+1,2)=\"DŽ\"),BS17+2,BS17+1)","v":68},{"$f":"IF(OR(MID($B16, BT17+1,2)=\"NJ\",MID($B16, BT17+1,2)=\"LJ\",MID($B16, BT17+1,2)=\"DŽ\"),BT17+2,BT17+1)","v":69},{"$f":"IF(OR(MID($B16, BU17+1,2)=\"NJ\",MID($B16, BU17+1,2)=\"LJ\",MID($B16, BU17+1,2)=\"DŽ\"),BU17+2,BU17+1)","v":70}]
[9,"Za početak pritisni gumb \"Očisti tabelu!\"",41,9,{"$f":"IF(OR(LEFT(B18, 2) =\"NJ\", LEFT(B18, 2) =\"LJ\", LEFT(B18, 2) =\"DŽ\"), LEFT(B18, 2), LEFT(B18, 1))","v":"Z"},{"$f":"IF(OR(MID($B18, E19+1,2) =\"NJ\", MID($B18, E19+1,2) =\"LJ\", MID($B18, E19+1,2) =\"DŽ\"), MID($B18, E19+1,2),MID($B18, E19+1,1))","v":"a"}," ","p","o","č","e","t","a","k"," ","p","r","i","t","i","s","n","i"," ","g","u","m","b"," ","\"","O","č","i","s","t","i"," ","t","a","b","e","l","u","!","\"","","","","","","","","","","","","","","","","","","","","","","","",{"$f":"IF(OR(MID($B18, BP19+1,2) =\"NJ\", MID($B18, BP19+1,2) =\"LJ\", MID($B18, BP19+1,2) =\"DŽ\"), MID($B18, BP19+1,2),MID($B18, BP19+1,1))","v":""},"","","","",""]
[null,null,null,null,{"$f":"IF(OR(LEFT(B18, 2) =\"NJ\", LEFT(B18, 2) =\"LJ\", LEFT(B18, 2) =\"DŽ\"),2,1)","v":1},{"$f":"IF(OR(MID($B18, E19+1,2)=\"NJ\",MID($B18, E19+1,2)=\"LJ\",MID($B18, E19+1,2)=\"DŽ\"),E19+2,E19+1)","v":2},{"$f":"IF(OR(MID($B18, F19+1,2)=\"NJ\",MID($B18, F19+1,2)=\"LJ\",MID($B18, F19+1,2)=\"DŽ\"),F19+2,F19+1)","v":3},{"$f":"IF(OR(MID($B18, G19+1,2)=\"NJ\",MID($B18, G19+1,2)=\"LJ\",MID($B18, G19+1,2)=\"DŽ\"),G19+2,G19+1)","v":4},{"$f":"IF(OR(MID($B18, H19+1,2)=\"NJ\",MID($B18, H19+1,2)=\"LJ\",MID($B18, H19+1,2)=\"DŽ\"),H19+2,H19+1)","v":5},{"$f":"IF(OR(MID($B18, I19+1,2)=\"NJ\",MID($B18, I19+1,2)=\"LJ\",MID($B18, I19+1,2)=\"DŽ\"),I19+2,I19+1)","v":6},{"$f":"IF(OR(MID($B18, J19+1,2)=\"NJ\",MID($B18, J19+1,2)=\"LJ\",MID($B18, J19+1,2)=\"DŽ\"),J19+2,J19+1)","v":7},{"$f":"IF(OR(MID($B18, K19+1,2)=\"NJ\",MID($B18, K19+1,2)=\"LJ\",MID($B18, K19+1,2)=\"DŽ\"),K19+2,K19+1)","v":8},{"$f":"IF(OR(MID($B18, L19+1,2)=\"NJ\",MID($B18, L19+1,2)=\"LJ\",MID($B18, L19+1,2)=\"DŽ\"),L19+2,L19+1)","v":9},{"$f":"IF(OR(MID($B18, M19+1,2)=\"NJ\",MID($B18, M19+1,2)=\"LJ\",MID($B18, M19+1,2)=\"DŽ\"),M19+2,M19+1)","v":10},{"$f":"IF(OR(MID($B18, N19+1,2)=\"NJ\",MID($B18, N19+1,2)=\"LJ\",MID($B18, N19+1,2)=\"DŽ\"),N19+2,N19+1)","v":11},{"$f":"IF(OR(MID($B18, O19+1,2)=\"NJ\",MID($B18, O19+1,2)=\"LJ\",MID($B18, O19+1,2)=\"DŽ\"),O19+2,O19+1)","v":12},{"$f":"IF(OR(MID($B18, P19+1,2)=\"NJ\",MID($B18, P19+1,2)=\"LJ\",MID($B18, P19+1,2)=\"DŽ\"),P19+2,P19+1)","v":13},{"$f":"IF(OR(MID($B18, Q19+1,2)=\"NJ\",MID($B18, Q19+1,2)=\"LJ\",MID($B18, Q19+1,2)=\"DŽ\"),Q19+2,Q19+1)","v":14},{"$f":"IF(OR(MID($B18, R19+1,2)=\"NJ\",MID($B18, R19+1,2)=\"LJ\",MID($B18, R19+1,2)=\"DŽ\"),R19+2,R19+1)","v":15},{"$f":"IF(OR(MID($B18, S19+1,2)=\"NJ\",MID($B18, S19+1,2)=\"LJ\",MID($B18, S19+1,2)=\"DŽ\"),S19+2,S19+1)","v":16},{"$f":"IF(OR(MID($B18, T19+1,2)=\"NJ\",MID($B18, T19+1,2)=\"LJ\",MID($B18, T19+1,2)=\"DŽ\"),T19+2,T19+1)","v":17},{"$f":"IF(OR(MID($B18, U19+1,2)=\"NJ\",MID($B18, U19+1,2)=\"LJ\",MID($B18, U19+1,2)=\"DŽ\"),U19+2,U19+1)","v":18},{"$f":"IF(OR(MID($B18, V19+1,2)=\"NJ\",MID($B18, V19+1,2)=\"LJ\",MID($B18, V19+1,2)=\"DŽ\"),V19+2,V19+1)","v":19},{"$f":"IF(OR(MID($B18, W19+1,2)=\"NJ\",MID($B18, W19+1,2)=\"LJ\",MID($B18, W19+1,2)=\"DŽ\"),W19+2,W19+1)","v":20},{"$f":"IF(OR(MID($B18, X19+1,2)=\"NJ\",MID($B18, X19+1,2)=\"LJ\",MID($B18, X19+1,2)=\"DŽ\"),X19+2,X19+1)","v":21},{"$f":"IF(OR(MID($B18, Y19+1,2)=\"NJ\",MID($B18, Y19+1,2)=\"LJ\",MID($B18, Y19+1,2)=\"DŽ\"),Y19+2,Y19+1)","v":22},{"$f":"IF(OR(MID($B18, Z19+1,2)=\"NJ\",MID($B18, Z19+1,2)=\"LJ\",MID($B18, Z19+1,2)=\"DŽ\"),Z19+2,Z19+1)","v":23},{"$f":"IF(OR(MID($B18, AA19+1,2)=\"NJ\",MID($B18, AA19+1,2)=\"LJ\",MID($B18, AA19+1,2)=\"DŽ\"),AA19+2,AA19+1)","v":24},{"$f":"IF(OR(MID($B18, AB19+1,2)=\"NJ\",MID($B18, AB19+1,2)=\"LJ\",MID($B18, AB19+1,2)=\"DŽ\"),AB19+2,AB19+1)","v":25},{"$f":"IF(OR(MID($B18, AC19+1,2)=\"NJ\",MID($B18, AC19+1,2)=\"LJ\",MID($B18, AC19+1,2)=\"DŽ\"),AC19+2,AC19+1)","v":26},{"$f":"IF(OR(MID($B18, AD19+1,2)=\"NJ\",MID($B18, AD19+1,2)=\"LJ\",MID($B18, AD19+1,2)=\"DŽ\"),AD19+2,AD19+1)","v":27},{"$f":"IF(OR(MID($B18, AE19+1,2)=\"NJ\",MID($B18, AE19+1,2)=\"LJ\",MID($B18, AE19+1,2)=\"DŽ\"),AE19+2,AE19+1)","v":28},{"$f":"IF(OR(MID($B18, AF19+1,2)=\"NJ\",MID($B18, AF19+1,2)=\"LJ\",MID($B18, AF19+1,2)=\"DŽ\"),AF19+2,AF19+1)","v":29},{"$f":"IF(OR(MID($B18, AG19+1,2)=\"NJ\",MID($B18, AG19+1,2)=\"LJ\",MID($B18, AG19+1,2)=\"DŽ\"),AG19+2,AG19+1)","v":30},{"$f":"IF(OR(MID($B18, AH19+1,2)=\"NJ\",MID($B18, AH19+1,2)=\"LJ\",MID($B18, AH19+1,2)=\"DŽ\"),AH19+2,AH19+1)","v":31},{"$f":"IF(OR(MID($B18, AI19+1,2)=\"NJ\",MID($B18, AI19+1,2)=\"LJ\",MID($B18, AI19+1,2)=\"DŽ\"),AI19+2,AI19+1)","v":32},{"$f":"IF(OR(MID($B18, AJ19+1,2)=\"NJ\",MID($B18, AJ19+1,2)=\"LJ\",MID($B18, AJ19+1,2)=\"DŽ\"),AJ19+2,AJ19+1)","v":33},{"$f":"IF(OR(MID($B18, AK19+1,2)=\"NJ\",MID($B18, AK19+1,2)=\"LJ\",MID($B18, AK19+1,2)=\"DŽ\"),AK19+2,AK19+1)","v":34},{"$f":"IF(OR(MID($B18, AL19+1,2)=\"NJ\",MID($B18, AL19+1,2)=\"LJ\",MID($B18, AL19+1,2)=\"DŽ\"),AL19+2,AL19+1)","v":35},{"$f":"IF(OR(MID($B18, AM19+1,2)=\"NJ\",MID($B18, AM19+1,2)=\"LJ\",MID($B18, AM19+1,2)=\"DŽ\"),AM19+2,AM19+1)","v":36},{"$f":"IF(OR(MID($B18, AN19+1,2)=\"NJ\",MID($B18, AN19+1,2)=\"LJ\",MID($B18, AN19+1,2)=\"DŽ\"),AN19+2,AN19+1)","v":37},{"$f":"IF(OR(MID($B18, AO19+1,2)=\"NJ\",MID($B18, AO19+1,2)=\"LJ\",MID($B18, AO19+1,2)=\"DŽ\"),AO19+2,AO19+1)","v":38},{"$f":"IF(OR(MID($B18, AP19+1,2)=\"NJ\",MID($B18, AP19+1,2)=\"LJ\",MID($B18, AP19+1,2)=\"DŽ\"),AP19+2,AP19+1)","v":39},{"$f":"IF(OR(MID($B18, AQ19+1,2)=\"NJ\",MID($B18, AQ19+1,2)=\"LJ\",MID($B18, AQ19+1,2)=\"DŽ\"),AQ19+2,AQ19+1)","v":40},{"$f":"IF(OR(MID($B18, AR19+1,2)=\"NJ\",MID($B18, AR19+1,2)=\"LJ\",MID($B18, AR19+1,2)=\"DŽ\"),AR19+2,AR19+1)","v":41},{"$f":"IF(OR(MID($B18, AS19+1,2)=\"NJ\",MID($B18, AS19+1,2)=\"LJ\",MID($B18, AS19+1,2)=\"DŽ\"),AS19+2,AS19+1)","v":42},{"$f":"IF(OR(MID($B18, AT19+1,2)=\"NJ\",MID($B18, AT19+1,2)=\"LJ\",MID($B18, AT19+1,2)=\"DŽ\"),AT19+2,AT19+1)","v":43},{"$f":"IF(OR(MID($B18, AU19+1,2)=\"NJ\",MID($B18, AU19+1,2)=\"LJ\",MID($B18, AU19+1,2)=\"DŽ\"),AU19+2,AU19+1)","v":44},{"$f":"IF(OR(MID($B18, AV19+1,2)=\"NJ\",MID($B18, AV19+1,2)=\"LJ\",MID($B18, AV19+1,2)=\"DŽ\"),AV19+2,AV19+1)","v":45},{"$f":"IF(OR(MID($B18, AW19+1,2)=\"NJ\",MID($B18, AW19+1,2)=\"LJ\",MID($B18, AW19+1,2)=\"DŽ\"),AW19+2,AW19+1)","v":46},{"$f":"IF(OR(MID($B18, AX19+1,2)=\"NJ\",MID($B18, AX19+1,2)=\"LJ\",MID($B18, AX19+1,2)=\"DŽ\"),AX19+2,AX19+1)","v":47},{"$f":"IF(OR(MID($B18, AY19+1,2)=\"NJ\",MID($B18, AY19+1,2)=\"LJ\",MID($B18, AY19+1,2)=\"DŽ\"),AY19+2,AY19+1)","v":48},{"$f":"IF(OR(MID($B18, AZ19+1,2)=\"NJ\",MID($B18, AZ19+1,2)=\"LJ\",MID($B18, AZ19+1,2)=\"DŽ\"),AZ19+2,AZ19+1)","v":49},{"$f":"IF(OR(MID($B18, BA19+1,2)=\"NJ\",MID($B18, BA19+1,2)=\"LJ\",MID($B18, BA19+1,2)=\"DŽ\"),BA19+2,BA19+1)","v":50},{"$f":"IF(OR(MID($B18, BB19+1,2)=\"NJ\",MID($B18, BB19+1,2)=\"LJ\",MID($B18, BB19+1,2)=\"DŽ\"),BB19+2,BB19+1)","v":51},{"$f":"IF(OR(MID($B18, BC19+1,2)=\"NJ\",MID($B18, BC19+1,2)=\"LJ\",MID($B18, BC19+1,2)=\"DŽ\"),BC19+2,BC19+1)","v":52},{"$f":"IF(OR(MID($B18, BD19+1,2)=\"NJ\",MID($B18, BD19+1,2)=\"LJ\",MID($B18, BD19+1,2)=\"DŽ\"),BD19+2,BD19+1)","v":53},{"$f":"IF(OR(MID($B18, BE19+1,2)=\"NJ\",MID($B18, BE19+1,2)=\"LJ\",MID($B18, BE19+1,2)=\"DŽ\"),BE19+2,BE19+1)","v":54},{"$f":"IF(OR(MID($B18, BF19+1,2)=\"NJ\",MID($B18, BF19+1,2)=\"LJ\",MID($B18, BF19+1,2)=\"DŽ\"),BF19+2,BF19+1)","v":55},{"$f":"IF(OR(MID($B18, BG19+1,2)=\"NJ\",MID($B18, BG19+1,2)=\"LJ\",MID($B18, BG19+1,2)=\"DŽ\"),BG19+2,BG19+1)","v":56},{"$f":"IF(OR(MID($B18, BH19+1,2)=\"NJ\",MID($B18, BH19+1,2)=\"LJ\",MID($B18, BH19+1,2)=\"DŽ\"),BH19+2,BH19+1)","v":57},{"$f":"IF(OR(MID($B18, BI19+1,2)=\"NJ\",MID($B18, BI19+1,2)=\"LJ\",MID($B18, BI19+1,2)=\"DŽ\"),BI19+2,BI19+1)","v":58},{"$f":"IF(OR(MID($B18, BJ19+1,2)=\"NJ\",MID($B18, BJ19+1,2)=\"LJ\",MID($B18, BJ19+1,2)=\"DŽ\"),BJ19+2,BJ19+1)","v":59},{"$f":"IF(OR(MID($B18, BK19+1,2)=\"NJ\",MID($B18, BK19+1,2)=\"LJ\",MID($B18, BK19+1,2)=\"DŽ\"),BK19+2,BK19+1)","v":60},{"$f":"IF(OR(MID($B18, BL19+1,2)=\"NJ\",MID($B18, BL19+1,2)=\"LJ\",MID($B18, BL19+1,2)=\"DŽ\"),BL19+2,BL19+1)","v":61},{"$f":"IF(OR(MID($B18, BM19+1,2)=\"NJ\",MID($B18, BM19+1,2)=\"LJ\",MID($B18, BM19+1,2)=\"DŽ\"),BM19+2,BM19+1)","v":62},{"$f":"IF(OR(MID($B18, BN19+1,2)=\"NJ\",MID($B18, BN19+1,2)=\"LJ\",MID($B18, BN19+1,2)=\"DŽ\"),BN19+2,BN19+1)","v":63},{"$f":"IF(OR(MID($B18, BO19+1,2)=\"NJ\",MID($B18, BO19+1,2)=\"LJ\",MID($B18, BO19+1,2)=\"DŽ\"),BO19+2,BO19+1)","v":64},{"$f":"IF(OR(MID($B18, BP19+1,2)=\"NJ\",MID($B18, BP19+1,2)=\"LJ\",MID($B18, BP19+1,2)=\"DŽ\"),BP19+2,BP19+1)","v":65},{"$f":"IF(OR(MID($B18, BQ19+1,2)=\"NJ\",MID($B18, BQ19+1,2)=\"LJ\",MID($B18, BQ19+1,2)=\"DŽ\"),BQ19+2,BQ19+1)","v":66},{"$f":"IF(OR(MID($B18, BR19+1,2)=\"NJ\",MID($B18, BR19+1,2)=\"LJ\",MID($B18, BR19+1,2)=\"DŽ\"),BR19+2,BR19+1)","v":67},{"$f":"IF(OR(MID($B18, BS19+1,2)=\"NJ\",MID($B18, BS19+1,2)=\"LJ\",MID($B18, BS19+1,2)=\"DŽ\"),BS19+2,BS19+1)","v":68},{"$f":"IF(OR(MID($B18, BT19+1,2)=\"NJ\",MID($B18, BT19+1,2)=\"LJ\",MID($B18, BT19+1,2)=\"DŽ\"),BT19+2,BT19+1)","v":69},{"$f":"IF(OR(MID($B18, BU19+1,2)=\"NJ\",MID($B18, BU19+1,2)=\"LJ\",MID($B18, BU19+1,2)=\"DŽ\"),BU19+2,BU19+1)","v":70}]
[10,null,0,10,{"$f":"IF(OR(LEFT(B20, 2) =\"NJ\", LEFT(B20, 2) =\"LJ\", LEFT(B20, 2) =\"DŽ\"), LEFT(B20, 2), LEFT(B20, 1))","v":""},{"$f":"IF(OR(MID($B20, E21+1,2) =\"NJ\", MID($B20, E21+1,2) =\"LJ\", MID($B20, E21+1,2) =\"DŽ\"), MID($B20, E21+1,2),MID($B20, E21+1,1))","v":""},"","","","","","","","","","","","","","","",{"$f":"IF(OR(MID($B20, U21+1,2) =\"NJ\", MID($B20, U21+1,2) =\"LJ\", MID($B20, U21+1,2) =\"DŽ\"), MID($B20, U21+1,2),MID($B20, U21+1,1))","v":""},"","","","","","","","","","","","","","","",{"$f":"IF(OR(MID($B20, AK21+1,2) =\"NJ\", MID($B20, AK21+1,2) =\"LJ\", MID($B20, AK21+1,2) =\"DŽ\"), MID($B20, AK21+1,2),MID($B20, AK21+1,1))","v":""},"","","","","","","","","","","","","","","",{"$f":"IF(OR(MID($B20, BA21+1,2) =\"NJ\", MID($B20, BA21+1,2) =\"LJ\", MID($B20, BA21+1,2) =\"DŽ\"), MID($B20, BA21+1,2),MID($B20, BA21+1,1))","v":""},"","","","","","","","","","","","","","","",{"$f":"IF(OR(MID($B20, BQ21+1,2) =\"NJ\", MID($B20, BQ21+1,2) =\"LJ\", MID($B20, BQ21+1,2) =\"DŽ\"), MID($B20, BQ21+1,2),MID($B20, BQ21+1,1))","v":""},"","","",""]
[null,null,null,null,{"$f":"IF(OR(LEFT(B20, 2) =\"NJ\", LEFT(B20, 2) =\"LJ\", LEFT(B20, 2) =\"DŽ\"),2,1)","v":1},{"$f":"IF(OR(MID($B20, E21+1,2)=\"NJ\",MID($B20, E21+1,2)=\"LJ\",MID($B20, E21+1,2)=\"DŽ\"),E21+2,E21+1)","v":2},{"$f":"IF(OR(MID($B20, F21+1,2)=\"NJ\",MID($B20, F21+1,2)=\"LJ\",MID($B20, F21+1,2)=\"DŽ\"),F21+2,F21+1)","v":3},{"$f":"IF(OR(MID($B20, G21+1,2)=\"NJ\",MID($B20, G21+1,2)=\"LJ\",MID($B20, G21+1,2)=\"DŽ\"),G21+2,G21+1)","v":4},{"$f":"IF(OR(MID($B20, H21+1,2)=\"NJ\",MID($B20, H21+1,2)=\"LJ\",MID($B20, H21+1,2)=\"DŽ\"),H21+2,H21+1)","v":5},{"$f":"IF(OR(MID($B20, I21+1,2)=\"NJ\",MID($B20, I21+1,2)=\"LJ\",MID($B20, I21+1,2)=\"DŽ\"),I21+2,I21+1)","v":6},{"$f":"IF(OR(MID($B20, J21+1,2)=\"NJ\",MID($B20, J21+1,2)=\"LJ\",MID($B20, J21+1,2)=\"DŽ\"),J21+2,J21+1)","v":7},{"$f":"IF(OR(MID($B20, K21+1,2)=\"NJ\",MID($B20, K21+1,2)=\"LJ\",MID($B20, K21+1,2)=\"DŽ\"),K21+2,K21+1)","v":8},{"$f":"IF(OR(MID($B20, L21+1,2)=\"NJ\",MID($B20, L21+1,2)=\"LJ\",MID($B20, L21+1,2)=\"DŽ\"),L21+2,L21+1)","v":9},{"$f":"IF(OR(MID($B20, M21+1,2)=\"NJ\",MID($B20, M21+1,2)=\"LJ\",MID($B20, M21+1,2)=\"DŽ\"),M21+2,M21+1)","v":10},{"$f":"IF(OR(MID($B20, N21+1,2)=\"NJ\",MID($B20, N21+1,2)=\"LJ\",MID($B20, N21+1,2)=\"DŽ\"),N21+2,N21+1)","v":11},{"$f":"IF(OR(MID($B20, O21+1,2)=\"NJ\",MID($B20, O21+1,2)=\"LJ\",MID($B20, O21+1,2)=\"DŽ\"),O21+2,O21+1)","v":12},{"$f":"IF(OR(MID($B20, P21+1,2)=\"NJ\",MID($B20, P21+1,2)=\"LJ\",MID($B20, P21+1,2)=\"DŽ\"),P21+2,P21+1)","v":13},{"$f":"IF(OR(MID($B20, Q21+1,2)=\"NJ\",MID($B20, Q21+1,2)=\"LJ\",MID($B20, Q21+1,2)=\"DŽ\"),Q21+2,Q21+1)","v":14},{"$f":"IF(OR(MID($B20, R21+1,2)=\"NJ\",MID($B20, R21+1,2)=\"LJ\",MID($B20, R21+1,2)=\"DŽ\"),R21+2,R21+1)","v":15},{"$f":"IF(OR(MID($B20, S21+1,2)=\"NJ\",MID($B20, S21+1,2)=\"LJ\",MID($B20, S21+1,2)=\"DŽ\"),S21+2,S21+1)","v":16},{"$f":"IF(OR(MID($B20, T21+1,2)=\"NJ\",MID($B20, T21+1,2)=\"LJ\",MID($B20, T21+1,2)=\"DŽ\"),T21+2,T21+1)","v":17},{"$f":"IF(OR(MID($B20, U21+1,2)=\"NJ\",MID($B20, U21+1,2)=\"LJ\",MID($B20, U21+1,2)=\"DŽ\"),U21+2,U21+1)","v":18},{"$f":"IF(OR(MID($B20, V21+1,2)=\"NJ\",MID($B20, V21+1,2)=\"LJ\",MID($B20, V21+1,2)=\"DŽ\"),V21+2,V21+1)","v":19},{"$f":"IF(OR(MID($B20, W21+1,2)=\"NJ\",MID($B20, W21+1,2)=\"LJ\",MID($B20, W21+1,2)=\"DŽ\"),W21+2,W21+1)","v":20},{"$f":"IF(OR(MID($B20, X21+1,2)=\"NJ\",MID($B20, X21+1,2)=\"LJ\",MID($B20, X21+1,2)=\"DŽ\"),X21+2,X21+1)","v":21},{"$f":"IF(OR(MID($B20, Y21+1,2)=\"NJ\",MID($B20, Y21+1,2)=\"LJ\",MID($B20, Y21+1,2)=\"DŽ\"),Y21+2,Y21+1)","v":22},{"$f":"IF(OR(MID($B20, Z21+1,2)=\"NJ\",MID($B20, Z21+1,2)=\"LJ\",MID($B20, Z21+1,2)=\"DŽ\"),Z21+2,Z21+1)","v":23},{"$f":"IF(OR(MID($B20, AA21+1,2)=\"NJ\",MID($B20, AA21+1,2)=\"LJ\",MID($B20, AA21+1,2)=\"DŽ\"),AA21+2,AA21+1)","v":24},{"$f":"IF(OR(MID($B20, AB21+1,2)=\"NJ\",MID($B20, AB21+1,2)=\"LJ\",MID($B20, AB21+1,2)=\"DŽ\"),AB21+2,AB21+1)","v":25},{"$f":"IF(OR(MID($B20, AC21+1,2)=\"NJ\",MID($B20, AC21+1,2)=\"LJ\",MID($B20, AC21+1,2)=\"DŽ\"),AC21+2,AC21+1)","v":26},{"$f":"IF(OR(MID($B20, AD21+1,2)=\"NJ\",MID($B20, AD21+1,2)=\"LJ\",MID($B20, AD21+1,2)=\"DŽ\"),AD21+2,AD21+1)","v":27},{"$f":"IF(OR(MID($B20, AE21+1,2)=\"NJ\",MID($B20, AE21+1,2)=\"LJ\",MID($B20, AE21+1,2)=\"DŽ\"),AE21+2,AE21+1)","v":28},{"$f":"IF(OR(MID($B20, AF21+1,2)=\"NJ\",MID($B20, AF21+1,2)=\"LJ\",MID($B20, AF21+1,2)=\"DŽ\"),AF21+2,AF21+1)","v":29},{"$f":"IF(OR(MID($B20, AG21+1,2)=\"NJ\",MID($B20, AG21+1,2)=\"LJ\",MID($B20, AG21+1,2)=\"DŽ\"),AG21+2,AG21+1)","v":30},{"$f":"IF(OR(MID($B20, AH21+1,2)=\"NJ\",MID($B20, AH21+1,2)=\"LJ\",MID($B20, AH21+1,2)=\"DŽ\"),AH21+2,AH21+1)","v":31},{"$f":"IF(OR(MID($B20, AI21+1,2)=\"NJ\",MID($B20, AI21+1,2)=\"LJ\",MID($B20, AI21+1,2)=\"DŽ\"),AI21+2,AI21+1)","v":32},{"$f":"IF(OR(MID($B20, AJ21+1,2)=\"NJ\",MID($B20, AJ21+1,2)=\"LJ\",MID($B20, AJ21+1,2)=\"DŽ\"),AJ21+2,AJ21+1)","v":33},{"$f":"IF(OR(MID($B20, AK21+1,2)=\"NJ\",MID($B20, AK21+1,2)=\"LJ\",MID($B20, AK21+1,2)=\"DŽ\"),AK21+2,AK21+1)","v":34},{"$f":"IF(OR(MID($B20, AL21+1,2)=\"NJ\",MID($B20, AL21+1,2)=\"LJ\",MID($B20, AL21+1,2)=\"DŽ\"),AL21+2,AL21+1)","v":35},{"$f":"IF(OR(MID($B20, AM21+1,2)=\"NJ\",MID($B20, AM21+1,2)=\"LJ\",MID($B20, AM21+1,2)=\"DŽ\"),AM21+2,AM21+1)","v":36},{"$f":"IF(OR(MID($B20, AN21+1,2)=\"NJ\",MID($B20, AN21+1,2)=\"LJ\",MID($B20, AN21+1,2)=\"DŽ\"),AN21+2,AN21+1)","v":37},{"$f":"IF(OR(MID($B20, AO21+1,2)=\"NJ\",MID($B20, AO21+1,2)=\"LJ\",MID($B20, AO21+1,2)=\"DŽ\"),AO21+2,AO21+1)","v":38},{"$f":"IF(OR(MID($B20, AP21+1,2)=\"NJ\",MID($B20, AP21+1,2)=\"LJ\",MID($B20, AP21+1,2)=\"DŽ\"),AP21+2,AP21+1)","v":39},{"$f":"IF(OR(MID($B20, AQ21+1,2)=\"NJ\",MID($B20, AQ21+1,2)=\"LJ\",MID($B20, AQ21+1,2)=\"DŽ\"),AQ21+2,AQ21+1)","v":40},{"$f":"IF(OR(MID($B20, AR21+1,2)=\"NJ\",MID($B20, AR21+1,2)=\"LJ\",MID($B20, AR21+1,2)=\"DŽ\"),AR21+2,AR21+1)","v":41},{"$f":"IF(OR(MID($B20, AS21+1,2)=\"NJ\",MID($B20, AS21+1,2)=\"LJ\",MID($B20, AS21+1,2)=\"DŽ\"),AS21+2,AS21+1)","v":42},{"$f":"IF(OR(MID($B20, AT21+1,2)=\"NJ\",MID($B20, AT21+1,2)=\"LJ\",MID($B20, AT21+1,2)=\"DŽ\"),AT21+2,AT21+1)","v":43},{"$f":"IF(OR(MID($B20, AU21+1,2)=\"NJ\",MID($B20, AU21+1,2)=\"LJ\",MID($B20, AU21+1,2)=\"DŽ\"),AU21+2,AU21+1)","v":44},{"$f":"IF(OR(MID($B20, AV21+1,2)=\"NJ\",MID($B20, AV21+1,2)=\"LJ\",MID($B20, AV21+1,2)=\"DŽ\"),AV21+2,AV21+1)","v":45},{"$f":"IF(OR(MID($B20, AW21+1,2)=\"NJ\",MID($B20, AW21+1,2)=\"LJ\",MID($B20, AW21+1,2)=\"DŽ\"),AW21+2,AW21+1)","v":46},{"$f":"IF(OR(MID($B20, AX21+1,2)=\"NJ\",MID($B20, AX21+1,2)=\"LJ\",MID($B20, AX21+1,2)=\"DŽ\"),AX21+2,AX21+1)","v":47},{"$f":"IF(OR(MID($B20, AY21+1,2)=\"NJ\",MID($B20, AY21+1,2)=\"LJ\",MID($B20, AY21+1,2)=\"DŽ\"),AY21+2,AY21+1)","v":48},{"$f":"IF(OR(MID($B20, AZ21+1,2)=\"NJ\",MID($B20, AZ21+1,2)=\"LJ\",MID($B20, AZ21+1,2)=\"DŽ\"),AZ21+2,AZ21+1)","v":49},{"$f":"IF(OR(MID($B20, BA21+1,2)=\"NJ\",MID($B20, BA21+1,2)=\"LJ\",MID($B20, BA21+1,2)=\"DŽ\"),BA21+2,BA21+1)","v":50},{"$f":"IF(OR(MID($B20, BB21+1,2)=\"NJ\",MID($B20, BB21+1,2)=\"LJ\",MID($B20, BB21+1,2)=\"DŽ\"),BB21+2,BB21+1)","v":51},{"$f":"IF(OR(MID($B20, BC21+1,2)=\"NJ\",MID($B20, BC21+1,2)=\"LJ\",MID($B20, BC21+1,2)=\"DŽ\"),BC21+2,BC21+1)","v":52},{"$f":"IF(OR(MID($B20, BD21+1,2)=\"NJ\",MID($B20, BD21+1,2)=\"LJ\",MID($B20, BD21+1,2)=\"DŽ\"),BD21+2,BD21+1)","v":53},{"$f":"IF(OR(MID($B20, BE21+1,2)=\"NJ\",MID($B20, BE21+1,2)=\"LJ\",MID($B20, BE21+1,2)=\"DŽ\"),BE21+2,BE21+1)","v":54},{"$f":"IF(OR(MID($B20, BF21+1,2)=\"NJ\",MID($B20, BF21+1,2)=\"LJ\",MID($B20, BF21+1,2)=\"DŽ\"),BF21+2,BF21+1)","v":55},{"$f":"IF(OR(MID($B20, BG21+1,2)=\"NJ\",MID($B20, BG21+1,2)=\"LJ\",MID($B20, BG21+1,2)=\"DŽ\"),BG21+2,BG21+1)","v":56},{"$f":"IF(OR(MID($B20, BH21+1,2)=\"NJ\",MID($B20, BH21+1,2)=\"LJ\",MID($B20, BH21+1,2)=\"DŽ\"),BH21+2,BH21+1)","v":57},{"$f":"IF(OR(MID($B20, BI21+1,2)=\"NJ\",MID($B20, BI21+1,2)=\"LJ\",MID($B20, BI21+1,2)=\"DŽ\"),BI21+2,BI21+1)","v":58},{"$f":"IF(OR(MID($B20, BJ21+1,2)=\"NJ\",MID($B20, BJ21+1,2)=\"LJ\",MID($B20, BJ21+1,2)=\"DŽ\"),BJ21+2,BJ21+1)","v":59},{"$f":"IF(OR(MID($B20, BK21+1,2)=\"NJ\",MID($B20, BK21+1,2)=\"LJ\",MID($B20, BK21+1,2)=\"DŽ\"),BK21+2,BK21+1)","v":60},{"$f":"IF(OR(MID($B20, BL21+1,2)=\"NJ\",MID($B20, BL21+1,2)=\"LJ\",MID($B20, BL21+1,2)=\"DŽ\"),BL21+2,BL21+1)","v":61},{"$f":"IF(OR(MID($B20, BM21+1,2)=\"NJ\",MID($B20, BM21+1,2)=\"LJ\",MID($B20, BM21+1,2)=\"DŽ\"),BM21+2,BM21+1)","v":62},{"$f":"IF(OR(MID($B20, BN21+1,2)=\"NJ\",MID($B20, BN21+1,2)=\"LJ\",MID($B20, BN21+1,2)=\"DŽ\"),BN21+2,BN21+1)","v":63},{"$f":"IF(OR(MID($B20, BO21+1,2)=\"NJ\",MID($B20, BO21+1,2)=\"LJ\",MID($B20, BO21+1,2)=\"DŽ\"),BO21+2,BO21+1)","v":64},{"$f":"IF(OR(MID($B20, BP21+1,2)=\"NJ\",MID($B20, BP21+1,2)=\"LJ\",MID($B20, BP21+1,2)=\"DŽ\"),BP21+2,BP21+1)","v":65},{"$f":"IF(OR(MID($B20, BQ21+1,2)=\"NJ\",MID($B20, BQ21+1,2)=\"LJ\",MID($B20, BQ21+1,2)=\"DŽ\"),BQ21+2,BQ21+1)","v":66},{"$f":"IF(OR(MID($B20, BR21+1,2)=\"NJ\",MID($B20, BR21+1,2)=\"LJ\",MID($B20, BR21+1,2)=\"DŽ\"),BR21+2,BR21+1)","v":67},{"$f":"IF(OR(MID($B20, BS21+1,2)=\"NJ\",MID($B20, BS21+1,2)=\"LJ\",MID($B20, BS21+1,2)=\"DŽ\"),BS21+2,BS21+1)","v":68},{"$f":"IF(OR(MID($B20, BT21+1,2)=\"NJ\",MID($B20, BT21+1,2)=\"LJ\",MID($B20, BT21+1,2)=\"DŽ\"),BT21+2,BT21+1)","v":69},{"$f":"IF(OR(MID($B20, BU21+1,2)=\"NJ\",MID($B20, BU21+1,2)=\"LJ\",MID($B20, BU21+1,2)=\"DŽ\"),BU21+2,BU21+1)","v":70}]
[11,null,0,11,{"$f":"IF(OR(LEFT(B22, 2) =\"NJ\", LEFT(B22, 2) =\"LJ\", LEFT(B22, 2) =\"DŽ\"), LEFT(B22, 2), LEFT(B22, 1))","v":""},{"$f":"IF(OR(MID($B22, E23+1,2) =\"NJ\", MID($B22, E23+1,2) =\"LJ\", MID($B22, E23+1,2) =\"DŽ\"), MID($B22, E23+1,2),MID($B22, E23+1,1))","v":""},"","","","","","","","","","","","","","","",{"$f":"IF(OR(MID($B22, U23+1,2) =\"NJ\", MID($B22, U23+1,2) =\"LJ\", MID($B22, U23+1,2) =\"DŽ\"), MID($B22, U23+1,2),MID($B22, U23+1,1))","v":""},"","","","","","","","","","","","","","","",{"$f":"IF(OR(MID($B22, AK23+1,2) =\"NJ\", MID($B22, AK23+1,2) =\"LJ\", MID($B22, AK23+1,2) =\"DŽ\"), MID($B22, AK23+1,2),MID($B22, AK23+1,1))","v":""},"","","","","","","","","","","","","","","",{"$f":"IF(OR(MID($B22, BA23+1,2) =\"NJ\", MID($B22, BA23+1,2) =\"LJ\", MID($B22, BA23+1,2) =\"DŽ\"), MID($B22, BA23+1,2),MID($B22, BA23+1,1))","v":""},"","","","","","","","","","","","","","","",{"$f":"IF(OR(MID($B22, BQ23+1,2) =\"NJ\", MID($B22, BQ23+1,2) =\"LJ\", MID($B22, BQ23+1,2) =\"DŽ\"), MID($B22, BQ23+1,2),MID($B22, BQ23+1,1))","v":""},"","","",""]
[null,null,null,null,{"$f":"IF(OR(LEFT(B22, 2) =\"NJ\", LEFT(B22, 2) =\"LJ\", LEFT(B22, 2) =\"DŽ\"),2,1)","v":1},{"$f":"IF(OR(MID($B22, E23+1,2)=\"NJ\",MID($B22, E23+1,2)=\"LJ\",MID($B22, E23+1,2)=\"DŽ\"),E23+2,E23+1)","v":2},{"$f":"IF(OR(MID($B22, F23+1,2)=\"NJ\",MID($B22, F23+1,2)=\"LJ\",MID($B22, F23+1,2)=\"DŽ\"),F23+2,F23+1)","v":3},{"$f":"IF(OR(MID($B22, G23+1,2)=\"NJ\",MID($B22, G23+1,2)=\"LJ\",MID($B22, G23+1,2)=\"DŽ\"),G23+2,G23+1)","v":4},{"$f":"IF(OR(MID($B22, H23+1,2)=\"NJ\",MID($B22, H23+1,2)=\"LJ\",MID($B22, H23+1,2)=\"DŽ\"),H23+2,H23+1)","v":5},{"$f":"IF(OR(MID($B22, I23+1,2)=\"NJ\",MID($B22, I23+1,2)=\"LJ\",MID($B22, I23+1,2)=\"DŽ\"),I23+2,I23+1)","v":6},{"$f":"IF(OR(MID($B22, J23+1,2)=\"NJ\",MID($B22, J23+1,2)=\"LJ\",MID($B22, J23+1,2)=\"DŽ\"),J23+2,J23+1)","v":7},{"$f":"IF(OR(MID($B22, K23+1,2)=\"NJ\",MID($B22, K23+1,2)=\"LJ\",MID($B22, K23+1,2)=\"DŽ\"),K23+2,K23+1)","v":8},{"$f":"IF(OR(MID($B22, L23+1,2)=\"NJ\",MID($B22, L23+1,2)=\"LJ\",MID($B22, L23+1,2)=\"DŽ\"),L23+2,L23+1)","v":9},{"$f":"IF(OR(MID($B22, M23+1,2)=\"NJ\",MID($B22, M23+1,2)=\"LJ\",MID($B22, M23+1,2)=\"DŽ\"),M23+2,M23+1)","v":10},{"$f":"IF(OR(MID($B22, N23+1,2)=\"NJ\",MID($B22, N23+1,2)=\"LJ\",MID($B22, N23+1,2)=\"DŽ\"),N23+2,N23+1)","v":11},{"$f":"IF(OR(MID($B22, O23+1,2)=\"NJ\",MID($B22, O23+1,2)=\"LJ\",MID($B22, O23+1,2)=\"DŽ\"),O23+2,O23+1)","v":12},{"$f":"IF(OR(MID($B22, P23+1,2)=\"NJ\",MID($B22, P23+1,2)=\"LJ\",MID($B22, P23+1,2)=\"DŽ\"),P23+2,P23+1)","v":13},{"$f":"IF(OR(MID($B22, Q23+1,2)=\"NJ\",MID($B22, Q23+1,2)=\"LJ\",MID($B22, Q23+1,2)=\"DŽ\"),Q23+2,Q23+1)","v":14},{"$f":"IF(OR(MID($B22, R23+1,2)=\"NJ\",MID($B22, R23+1,2)=\"LJ\",MID($B22, R23+1,2)=\"DŽ\"),R23+2,R23+1)","v":15},{"$f":"IF(OR(MID($B22, S23+1,2)=\"NJ\",MID($B22, S23+1,2)=\"LJ\",MID($B22, S23+1,2)=\"DŽ\"),S23+2,S23+1)","v":16},{"$f":"IF(OR(MID($B22, T23+1,2)=\"NJ\",MID($B22, T23+1,2)=\"LJ\",MID($B22, T23+1,2)=\"DŽ\"),T23+2,T23+1)","v":17},{"$f":"IF(OR(MID($B22, U23+1,2)=\"NJ\",MID($B22, U23+1,2)=\"LJ\",MID($B22, U23+1,2)=\"DŽ\"),U23+2,U23+1)","v":18},{"$f":"IF(OR(MID($B22, V23+1,2)=\"NJ\",MID($B22, V23+1,2)=\"LJ\",MID($B22, V23+1,2)=\"DŽ\"),V23+2,V23+1)","v":19},{"$f":"IF(OR(MID($B22, W23+1,2)=\"NJ\",MID($B22, W23+1,2)=\"LJ\",MID($B22, W23+1,2)=\"DŽ\"),W23+2,W23+1)","v":20},{"$f":"IF(OR(MID($B22, X23+1,2)=\"NJ\",MID($B22, X23+1,2)=\"LJ\",MID($B22, X23+1,2)=\"DŽ\"),X23+2,X23+1)","v":21},{"$f":"IF(OR(MID($B22, Y23+1,2)=\"NJ\",MID($B22, Y23+1,2)=\"LJ\",MID($B22, Y23+1,2)=\"DŽ\"),Y23+2,Y23+1)","v":22},{"$f":"IF(OR(MID($B22, Z23+1,2)=\"NJ\",MID($B22, Z23+1,2)=\"LJ\",MID($B22, Z23+1,2)=\"DŽ\"),Z23+2,Z23+1)","v":23},{"$f":"IF(OR(MID($B22, AA23+1,2)=\"NJ\",MID($B22, AA23+1,2)=\"LJ\",MID($B22, AA23+1,2)=\"DŽ\"),AA23+2,AA23+1)","v":24},{"$f":"IF(OR(MID($B22, AB23+1,2)=\"NJ\",MID($B22, AB23+1,2)=\"LJ\",MID($B22, AB23+1,2)=\"DŽ\"),AB23+2,AB23+1)","v":25},{"$f":"IF(OR(MID($B22, AC23+1,2)=\"NJ\",MID($B22, AC23+1,2)=\"LJ\",MID($B22, AC23+1,2)=\"DŽ\"),AC23+2,AC23+1)","v":26},{"$f":"IF(OR(MID($B22, AD23+1,2)=\"NJ\",MID($B22, AD23+1,2)=\"LJ\",MID($B22, AD23+1,2)=\"DŽ\"),AD23+2,AD23+1)","v":27},{"$f":"IF(OR(MID($B22, AE23+1,2)=\"NJ\",MID($B22, AE23+1,2)=\"LJ\",MID($B22, AE23+1,2)=\"DŽ\"),AE23+2,AE23+1)","v":28},{"$f":"IF(OR(MID($B22, AF23+1,2)=\"NJ\",MID($B22, AF23+1,2)=\"LJ\",MID($B22, AF23+1,2)=\"DŽ\"),AF23+2,AF23+1)","v":29},{"$f":"IF(OR(MID($B22, AG23+1,2)=\"NJ\",MID($B22, AG23+1,2)=\"LJ\",MID($B22, AG23+1,2)=\"DŽ\"),AG23+2,AG23+1)","v":30},{"$f":"IF(OR(MID($B22, AH23+1,2)=\"NJ\",MID($B22, AH23+1,2)=\"LJ\",MID($B22, AH23+1,2)=\"DŽ\"),AH23+2,AH23+1)","v":31},{"$f":"IF(OR(MID($B22, AI23+1,2)=\"NJ\",MID($B22, AI23+1,2)=\"LJ\",MID($B22, AI23+1,2)=\"DŽ\"),AI23+2,AI23+1)","v":32},{"$f":"IF(OR(MID($B22, AJ23+1,2)=\"NJ\",MID($B22, AJ23+1,2)=\"LJ\",MID($B22, AJ23+1,2)=\"DŽ\"),AJ23+2,AJ23+1)","v":33},{"$f":"IF(OR(MID($B22, AK23+1,2)=\"NJ\",MID($B22, AK23+1,2)=\"LJ\",MID($B22, AK23+1,2)=\"DŽ\"),AK23+2,AK23+1)","v":34},{"$f":"IF(OR(MID($B22, AL23+1,2)=\"NJ\",MID($B22, AL23+1,2)=\"LJ\",MID($B22, AL23+1,2)=\"DŽ\"),AL23+2,AL23+1)","v":35},{"$f":"IF(OR(MID($B22, AM23+1,2)=\"NJ\",MID($B22, AM23+1,2)=\"LJ\",MID($B22, AM23+1,2)=\"DŽ\"),AM23+2,AM23+1)","v":36},{"$f":"IF(OR(MID($B22, AN23+1,2)=\"NJ\",MID($B22, AN23+1,2)=\"LJ\",MID($B22, AN23+1,2)=\"DŽ\"),AN23+2,AN23+1)","v":37},{"$f":"IF(OR(MID($B22, AO23+1,2)=\"NJ\",MID($B22, AO23+1,2)=\"LJ\",MID($B22, AO23+1,2)=\"DŽ\"),AO23+2,AO23+1)","v":38},{"$f":"IF(OR(MID($B22, AP23+1,2)=\"NJ\",MID($B22, AP23+1,2)=\"LJ\",MID($B22, AP23+1,2)=\"DŽ\"),AP23+2,AP23+1)","v":39},{"$f":"IF(OR(MID($B22, AQ23+1,2)=\"NJ\",MID($B22, AQ23+1,2)=\"LJ\",MID($B22, AQ23+1,2)=\"DŽ\"),AQ23+2,AQ23+1)","v":40},{"$f":"IF(OR(MID($B22, AR23+1,2)=\"NJ\",MID($B22, AR23+1,2)=\"LJ\",MID($B22, AR23+1,2)=\"DŽ\"),AR23+2,AR23+1)","v":41},{"$f":"IF(OR(MID($B22, AS23+1,2)=\"NJ\",MID($B22, AS23+1,2)=\"LJ\",MID($B22, AS23+1,2)=\"DŽ\"),AS23+2,AS23+1)","v":42},{"$f":"IF(OR(MID($B22, AT23+1,2)=\"NJ\",MID($B22, AT23+1,2)=\"LJ\",MID($B22, AT23+1,2)=\"DŽ\"),AT23+2,AT23+1)","v":43},{"$f":"IF(OR(MID($B22, AU23+1,2)=\"NJ\",MID($B22, AU23+1,2)=\"LJ\",MID($B22, AU23+1,2)=\"DŽ\"),AU23+2,AU23+1)","v":44},{"$f":"IF(OR(MID($B22, AV23+1,2)=\"NJ\",MID($B22, AV23+1,2)=\"LJ\",MID($B22, AV23+1,2)=\"DŽ\"),AV23+2,AV23+1)","v":45},{"$f":"IF(OR(MID($B22, AW23+1,2)=\"NJ\",MID($B22, AW23+1,2)=\"LJ\",MID($B22, AW23+1,2)=\"DŽ\"),AW23+2,AW23+1)","v":46},{"$f":"IF(OR(MID($B22, AX23+1,2)=\"NJ\",MID($B22, AX23+1,2)=\"LJ\",MID($B22, AX23+1,2)=\"DŽ\"),AX23+2,AX23+1)","v":47},{"$f":"IF(OR(MID($B22, AY23+1,2)=\"NJ\",MID($B22, AY23+1,2)=\"LJ\",MID($B22, AY23+1,2)=\"DŽ\"),AY23+2,AY23+1)","v":48},{"$f":"IF(OR(MID($B22, AZ23+1,2)=\"NJ\",MID($B22, AZ23+1,2)=\"LJ\",MID($B22, AZ23+1,2)=\"DŽ\"),AZ23+2,AZ23+1)","v":49},{"$f":"IF(OR(MID($B22, BA23+1,2)=\"NJ\",MID($B22, BA23+1,2)=\"LJ\",MID($B22, BA23+1,2)=\"DŽ\"),BA23+2,BA23+1)","v":50},{"$f":"IF(OR(MID($B22, BB23+1,2)=\"NJ\",MID($B22, BB23+1,2)=\"LJ\",MID($B22, BB23+1,2)=\"DŽ\"),BB23+2,BB23+1)","v":51},{"$f":"IF(OR(MID($B22, BC23+1,2)=\"NJ\",MID($B22, BC23+1,2)=\"LJ\",MID($B22, BC23+1,2)=\"DŽ\"),BC23+2,BC23+1)","v":52},{"$f":"IF(OR(MID($B22, BD23+1,2)=\"NJ\",MID($B22, BD23+1,2)=\"LJ\",MID($B22, BD23+1,2)=\"DŽ\"),BD23+2,BD23+1)","v":53},{"$f":"IF(OR(MID($B22, BE23+1,2)=\"NJ\",MID($B22, BE23+1,2)=\"LJ\",MID($B22, BE23+1,2)=\"DŽ\"),BE23+2,BE23+1)","v":54},{"$f":"IF(OR(MID($B22, BF23+1,2)=\"NJ\",MID($B22, BF23+1,2)=\"LJ\",MID($B22, BF23+1,2)=\"DŽ\"),BF23+2,BF23+1)","v":55},{"$f":"IF(OR(MID($B22, BG23+1,2)=\"NJ\",MID($B22, BG23+1,2)=\"LJ\",MID($B22, BG23+1,2)=\"DŽ\"),BG23+2,BG23+1)","v":56},{"$f":"IF(OR(MID($B22, BH23+1,2)=\"NJ\",MID($B22, BH23+1,2)=\"LJ\",MID($B22, BH23+1,2)=\"DŽ\"),BH23+2,BH23+1)","v":57},{"$f":"IF(OR(MID($B22, BI23+1,2)=\"NJ\",MID($B22, BI23+1,2)=\"LJ\",MID($B22, BI23+1,2)=\"DŽ\"),BI23+2,BI23+1)","v":58},{"$f":"IF(OR(MID($B22, BJ23+1,2)=\"NJ\",MID($B22, BJ23+1,2)=\"LJ\",MID($B22, BJ23+1,2)=\"DŽ\"),BJ23+2,BJ23+1)","v":59},{"$f":"IF(OR(MID($B22, BK23+1,2)=\"NJ\",MID($B22, BK23+1,2)=\"LJ\",MID($B22, BK23+1,2)=\"DŽ\"),BK23+2,BK23+1)","v":60},{"$f":"IF(OR(MID($B22, BL23+1,2)=\"NJ\",MID($B22, BL23+1,2)=\"LJ\",MID($B22, BL23+1,2)=\"DŽ\"),BL23+2,BL23+1)","v":61},{"$f":"IF(OR(MID($B22, BM23+1,2)=\"NJ\",MID($B22, BM23+1,2)=\"LJ\",MID($B22, BM23+1,2)=\"DŽ\"),BM23+2,BM23+1)","v":62},{"$f":"IF(OR(MID($B22, BN23+1,2)=\"NJ\",MID($B22, BN23+1,2)=\"LJ\",MID($B22, BN23+1,2)=\"DŽ\"),BN23+2,BN23+1)","v":63},{"$f":"IF(OR(MID($B22, BO23+1,2)=\"NJ\",MID($B22, BO23+1,2)=\"LJ\",MID($B22, BO23+1,2)=\"DŽ\"),BO23+2,BO23+1)","v":64},{"$f":"IF(OR(MID($B22, BP23+1,2)=\"NJ\",MID($B22, BP23+1,2)=\"LJ\",MID($B22, BP23+1,2)=\"DŽ\"),BP23+2,BP23+1)","v":65},{"$f":"IF(OR(MID($B22, BQ23+1,2)=\"NJ\",MID($B22, BQ23+1,2)=\"LJ\",MID($B22, BQ23+1,2)=\"DŽ\"),BQ23+2,BQ23+1)","v":66},{"$f":"IF(OR(MID($B22, BR23+1,2)=\"NJ\",MID($B22, BR23+1,2)=\"LJ\",MID($B22, BR23+1,2)=\"DŽ\"),BR23+2,BR23+1)","v":67},{"$f":"IF(OR(MID($B22, BS23+1,2)=\"NJ\",MID($B22, BS23+1,2)=\"LJ\",MID($B22, BS23+1,2)=\"DŽ\"),BS23+2,BS23+1)","v":68},{"$f":"IF(OR(MID($B22, BT23+1,2)=\"NJ\",MID($B22, BT23+1,2)=\"LJ\",MID($B22, BT23+1,2)=\"DŽ\"),BT23+2,BT23+1)","v":69},{"$f":"IF(OR(MID($B22, BU23+1,2)=\"NJ\",MID($B22, BU23+1,2)=\"LJ\",MID($B22, BU23+1,2)=\"DŽ\"),BU23+2,BU23+1)","v":70}]
[12,null,0,12,{"$f":"IF(OR(LEFT(B24, 2) =\"NJ\", LEFT(B24, 2) =\"LJ\", LEFT(B24, 2) =\"DŽ\"), LEFT(B24, 2), LEFT(B24, 1))","v":""},{"$f":"IF(OR(MID($B24, E25+1,2) =\"NJ\", MID($B24, E25+1,2) =\"LJ\", MID($B24, E25+1,2) =\"DŽ\"), MID($B24, E25+1,2),MID($B24, E25+1,1))","v":""},"","","","","","","","","","","","","","","","","","","","","","","","","","","","","","","","","","","","","","","","","","","","","","","","","","","","","","","","","","","","","","","","","","","",""]
[null,null,null,null,{"$f":"IF(OR(LEFT(B24, 2) =\"NJ\", LEFT(B24, 2) =\"LJ\", LEFT(B24, 2) =\"DŽ\"),2,1)","v":1},{"$f":"IF(OR(MID($B24, E25+1,2)=\"NJ\",MID($B24, E25+1,2)=\"LJ\",MID($B24, E25+1,2)=\"DŽ\"),E25+2,E25+1)","v":2},{"$f":"IF(OR(MID($B24, F25+1,2)=\"NJ\",MID($B24, F25+1,2)=\"LJ\",MID($B24, F25+1,2)=\"DŽ\"),F25+2,F25+1)","v":3},{"$f":"IF(OR(MID($B24, G25+1,2)=\"NJ\",MID($B24, G25+1,2)=\"LJ\",MID($B24, G25+1,2)=\"DŽ\"),G25+2,G25+1)","v":4},{"$f":"IF(OR(MID($B24, H25+1,2)=\"NJ\",MID($B24, H25+1,2)=\"LJ\",MID($B24, H25+1,2)=\"DŽ\"),H25+2,H25+1)","v":5},{"$f":"IF(OR(MID($B24, I25+1,2)=\"NJ\",MID($B24, I25+1,2)=\"LJ\",MID($B24, I25+1,2)=\"DŽ\"),I25+2,I25+1)","v":6},{"$f":"IF(OR(MID($B24, J25+1,2)=\"NJ\",MID($B24, J25+1,2)=\"LJ\",MID($B24, J25+1,2)=\"DŽ\"),J25+2,J25+1)","v":7},{"$f":"IF(OR(MID($B24, K25+1,2)=\"NJ\",MID($B24, K25+1,2)=\"LJ\",MID($B24, K25+1,2)=\"DŽ\"),K25+2,K25+1)","v":8},{"$f":"IF(OR(MID($B24, L25+1,2)=\"NJ\",MID($B24, L25+1,2)=\"LJ\",MID($B24, L25+1,2)=\"DŽ\"),L25+2,L25+1)","v":9},{"$f":"IF(OR(MID($B24, M25+1,2)=\"NJ\",MID($B24, M25+1,2)=\"LJ\",MID($B24, M25+1,2)=\"DŽ\"),M25+2,M25+1)","v":10},{"$f":"IF(OR(MID($B24, N25+1,2)=\"NJ\",MID($B24, N25+1,2)=\"LJ\",MID($B24, N25+1,2)=\"DŽ\"),N25+2,N25+1)","v":11},{"$f":"IF(OR(MID($B24, O25+1,2)=\"NJ\",MID($B24, O25+1,2)=\"LJ\",MID($B24, O25+1,2)=\"DŽ\"),O25+2,O25+1)","v":12},{"$f":"IF(OR(MID($B24, P25+1,2)=\"NJ\",MID($B24, P25+1,2)=\"LJ\",MID($B24, P25+1,2)=\"DŽ\"),P25+2,P25+1)","v":13},{"$f":"IF(OR(MID($B24, Q25+1,2)=\"NJ\",MID($B24, Q25+1,2)=\"LJ\",MID($B24, Q25+1,2)=\"DŽ\"),Q25+2,Q25+1)","v":14},{"$f":"IF(OR(MID($B24, R25+1,2)=\"NJ\",MID($B24, R25+1,2)=\"LJ\",MID($B24, R25+1,2)=\"DŽ\"),R25+2,R25+1)","v":15},{"$f":"IF(OR(MID($B24, S25+1,2)=\"NJ\",MID($B24, S25+1,2)=\"LJ\",MID($B24, S25+1,2)=\"DŽ\"),S25+2,S25+1)","v":16},{"$f":"IF(OR(MID($B24, T25+1,2)=\"NJ\",MID($B24, T25+1,2)=\"LJ\",MID($B24, T25+1,2)=\"DŽ\"),T25+2,T25+1)","v":17},{"$f":"IF(OR(MID($B24, U25+1,2)=\"NJ\",MID($B24, U25+1,2)=\"LJ\",MID($B24, U25+1,2)=\"DŽ\"),U25+2,U25+1)","v":18},{"$f":"IF(OR(MID($B24, V25+1,2)=\"NJ\",MID($B24, V25+1,2)=\"LJ\",MID($B24, V25+1,2)=\"DŽ\"),V25+2,V25+1)","v":19},{"$f":"IF(OR(MID($B24, W25+1,2)=\"NJ\",MID($B24, W25+1,2)=\"LJ\",MID($B24, W25+1,2)=\"DŽ\"),W25+2,W25+1)","v":20},{"$f":"IF(OR(MID($B24, X25+1,2)=\"NJ\",MID($B24, X25+1,2)=\"LJ\",MID($B24, X25+1,2)=\"DŽ\"),X25+2,X25+1)","v":21},{"$f":"IF(OR(MID($B24, Y25+1,2)=\"NJ\",MID($B24, Y25+1,2)=\"LJ\",MID($B24, Y25+1,2)=\"DŽ\"),Y25+2,Y25+1)","v":22},{"$f":"IF(OR(MID($B24, Z25+1,2)=\"NJ\",MID($B24, Z25+1,2)=\"LJ\",MID($B24, Z25+1,2)=\"DŽ\"),Z25+2,Z25+1)","v":23},{"$f":"IF(OR(MID($B24, AA25+1,2)=\"NJ\",MID($B24, AA25+1,2)=\"LJ\",MID($B24, AA25+1,2)=\"DŽ\"),AA25+2,AA25+1)","v":24},{"$f":"IF(OR(MID($B24, AB25+1,2)=\"NJ\",MID($B24, AB25+1,2)=\"LJ\",MID($B24, AB25+1,2)=\"DŽ\"),AB25+2,AB25+1)","v":25},{"$f":"IF(OR(MID($B24, AC25+1,2)=\"NJ\",MID($B24, AC25+1,2)=\"LJ\",MID($B24, AC25+1,2)=\"DŽ\"),AC25+2,AC25+1)","v":26},{"$f":"IF(OR(MID($B24, AD25+1,2)=\"NJ\",MID($B24, AD25+1,2)=\"LJ\",MID($B24, AD25+1,2)=\"DŽ\"),AD25+2,AD25+1)","v":27},{"$f":"IF(OR(MID($B24, AE25+1,2)=\"NJ\",MID($B24, AE25+1,2)=\"LJ\",MID($B24, AE25+1,2)=\"DŽ\"),AE25+2,AE25+1)","v":28},{"$f":"IF(OR(MID($B24, AF25+1,2)=\"NJ\",MID($B24, AF25+1,2)=\"LJ\",MID($B24, AF25+1,2)=\"DŽ\"),AF25+2,AF25+1)","v":29},{"$f":"IF(OR(MID($B24, AG25+1,2)=\"NJ\",MID($B24, AG25+1,2)=\"LJ\",MID($B24, AG25+1,2)=\"DŽ\"),AG25+2,AG25+1)","v":30},{"$f":"IF(OR(MID($B24, AH25+1,2)=\"NJ\",MID($B24, AH25+1,2)=\"LJ\",MID($B24, AH25+1,2)=\"DŽ\"),AH25+2,AH25+1)","v":31},{"$f":"IF(OR(MID($B24, AI25+1,2)=\"NJ\",MID($B24, AI25+1,2)=\"LJ\",MID($B24, AI25+1,2)=\"DŽ\"),AI25+2,AI25+1)","v":32},{"$f":"IF(OR(MID($B24, AJ25+1,2)=\"NJ\",MID($B24, AJ25+1,2)=\"LJ\",MID($B24, AJ25+1,2)=\"DŽ\"),AJ25+2,AJ25+1)","v":33},{"$f":"IF(OR(MID($B24, AK25+1,2)=\"NJ\",MID($B24, AK25+1,2)=\"LJ\",MID($B24, AK25+1,2)=\"DŽ\"),AK25+2,AK25+1)","v":34},{"$f":"IF(OR(MID($B24, AL25+1,2)=\"NJ\",MID($B24, AL25+1,2)=\"LJ\",MID($B24, AL25+1,2)=\"DŽ\"),AL25+2,AL25+1)","v":35},{"$f":"IF(OR(MID($B24, AM25+1,2)=\"NJ\",MID($B24, AM25+1,2)=\"LJ\",MID($B24, AM25+1,2)=\"DŽ\"),AM25+2,AM25+1)","v":36},{"$f":"IF(OR(MID($B24, AN25+1,2)=\"NJ\",MID($B24, AN25+1,2)=\"LJ\",MID($B24, AN25+1,2)=\"DŽ\"),AN25+2,AN25+1)","v":37},{"$f":"IF(OR(MID($B24, AO25+1,2)=\"NJ\",MID($B24, AO25+1,2)=\"LJ\",MID($B24, AO25+1,2)=\"DŽ\"),AO25+2,AO25+1)","v":38},{"$f":"IF(OR(MID($B24, AP25+1,2)=\"NJ\",MID($B24, AP25+1,2)=\"LJ\",MID($B24, AP25+1,2)=\"DŽ\"),AP25+2,AP25+1)","v":39},{"$f":"IF(OR(MID($B24, AQ25+1,2)=\"NJ\",MID($B24, AQ25+1,2)=\"LJ\",MID($B24, AQ25+1,2)=\"DŽ\"),AQ25+2,AQ25+1)","v":40},{"$f":"IF(OR(MID($B24, AR25+1,2)=\"NJ\",MID($B24, AR25+1,2)=\"LJ\",MID($B24, AR25+1,2)=\"DŽ\"),AR25+2,AR25+1)","v":41},{"$f":"IF(OR(MID($B24, AS25+1,2)=\"NJ\",MID($B24, AS25+1,2)=\"LJ\",MID($B24, AS25+1,2)=\"DŽ\"),AS25+2,AS25+1)","v":42},{"$f":"IF(OR(MID($B24, AT25+1,2)=\"NJ\",MID($B24, AT25+1,2)=\"LJ\",MID($B24, AT25+1,2)=\"DŽ\"),AT25+2,AT25+1)","v":43},{"$f":"IF(OR(MID($B24, AU25+1,2)=\"NJ\",MID($B24, AU25+1,2)=\"LJ\",MID($B24, AU25+1,2)=\"DŽ\"),AU25+2,AU25+1)","v":44},{"$f":"IF(OR(MID($B24, AV25+1,2)=\"NJ\",MID($B24, AV25+1,2)=\"LJ\",MID($B24, AV25+1,2)=\"DŽ\"),AV25+2,AV25+1)","v":45},{"$f":"IF(OR(MID($B24, AW25+1,2)=\"NJ\",MID($B24, AW25+1,2)=\"LJ\",MID($B24, AW25+1,2)=\"DŽ\"),AW25+2,AW25+1)","v":46},{"$f":"IF(OR(MID($B24, AX25+1,2)=\"NJ\",MID($B24, AX25+1,2)=\"LJ\",MID($B24, AX25+1,2)=\"DŽ\"),AX25+2,AX25+1)","v":47},{"$f":"IF(OR(MID($B24, AY25+1,2)=\"NJ\",MID($B24, AY25+1,2)=\"LJ\",MID($B24, AY25+1,2)=\"DŽ\"),AY25+2,AY25+1)","v":48},{"$f":"IF(OR(MID($B24, AZ25+1,2)=\"NJ\",MID($B24, AZ25+1,2)=\"LJ\",MID($B24, AZ25+1,2)=\"DŽ\"),AZ25+2,AZ25+1)","v":49},{"$f":"IF(OR(MID($B24, BA25+1,2)=\"NJ\",MID($B24, BA25+1,2)=\"LJ\",MID($B24, BA25+1,2)=\"DŽ\"),BA25+2,BA25+1)","v":50},{"$f":"IF(OR(MID($B24, BB25+1,2)=\"NJ\",MID($B24, BB25+1,2)=\"LJ\",MID($B24, BB25+1,2)=\"DŽ\"),BB25+2,BB25+1)","v":51},{"$f":"IF(OR(MID($B24, BC25+1,2)=\"NJ\",MID($B24, BC25+1,2)=\"LJ\",MID($B24, BC25+1,2)=\"DŽ\"),BC25+2,BC25+1)","v":52},{"$f":"IF(OR(MID($B24, BD25+1,2)=\"NJ\",MID($B24, BD25+1,2)=\"LJ\",MID($B24, BD25+1,2)=\"DŽ\"),BD25+2,BD25+1)","v":53},{"$f":"IF(OR(MID($B24, BE25+1,2)=\"NJ\",MID($B24, BE25+1,2)=\"LJ\",MID($B24, BE25+1,2)=\"DŽ\"),BE25+2,BE25+1)","v":54},{"$f":"IF(OR(MID($B24, BF25+1,2)=\"NJ\",MID($B24, BF25+1,2)=\"LJ\",MID($B24, BF25+1,2)=\"DŽ\"),BF25+2,BF25+1)","v":55},{"$f":"IF(OR(MID($B24, BG25+1,2)=\"NJ\",MID($B24, BG25+1,2)=\"LJ\",MID($B24, BG25+1,2)=\"DŽ\"),BG25+2,BG25+1)","v":56},{"$f":"IF(OR(MID($B24, BH25+1,2)=\"NJ\",MID($B24, BH25+1,2)=\"LJ\",MID($B24, BH25+1,2)=\"DŽ\"),BH25+2,BH25+1)","v":57},{"$f":"IF(OR(MID($B24, BI25+1,2)=\"NJ\",MID($B24, BI25+1,2)=\"LJ\",MID($B24, BI25+1,2)=\"DŽ\"),BI25+2,BI25+1)","v":58},{"$f":"IF(OR(MID($B24, BJ25+1,2)=\"NJ\",MID($B24, BJ25+1,2)=\"LJ\",MID($B24, BJ25+1,2)=\"DŽ\"),BJ25+2,BJ25+1)","v":59},{"$f":"IF(OR(MID($B24, BK25+1,2)=\"NJ\",MID($B24, BK25+1,2)=\"LJ\",MID($B24, BK25+1,2)=\"DŽ\"),BK25+2,BK25+1)","v":60},{"$f":"IF(OR(MID($B24, BL25+1,2)=\"NJ\",MID($B24, BL25+1,2)=\"LJ\",MID($B24, BL25+1,2)=\"DŽ\"),BL25+2,BL25+1)","v":61},{"$f":"IF(OR(MID($B24, BM25+1,2)=\"NJ\",MID($B24, BM25+1,2)=\"LJ\",MID($B24, BM25+1,2)=\"DŽ\"),BM25+2,BM25+1)","v":62},{"$f":"IF(OR(MID($B24, BN25+1,2)=\"NJ\",MID($B24, BN25+1,2)=\"LJ\",MID($B24, BN25+1,2)=\"DŽ\"),BN25+2,BN25+1)","v":63},{"$f":"IF(OR(MID($B24, BO25+1,2)=\"NJ\",MID($B24, BO25+1,2)=\"LJ\",MID($B24, BO25+1,2)=\"DŽ\"),BO25+2,BO25+1)","v":64},{"$f":"IF(OR(MID($B24, BP25+1,2)=\"NJ\",MID($B24, BP25+1,2)=\"LJ\",MID($B24, BP25+1,2)=\"DŽ\"),BP25+2,BP25+1)","v":65},{"$f":"IF(OR(MID($B24, BQ25+1,2)=\"NJ\",MID($B24, BQ25+1,2)=\"LJ\",MID($B24, BQ25+1,2)=\"DŽ\"),BQ25+2,BQ25+1)","v":66},{"$f":"IF(OR(MID($B24, BR25+1,2)=\"NJ\",MID($B24, BR25+1,2)=\"LJ\",MID($B24, BR25+1,2)=\"DŽ\"),BR25+2,BR25+1)","v":67},{"$f":"IF(OR(MID($B24, BS25+1,2)=\"NJ\",MID($B24, BS25+1,2)=\"LJ\",MID($B24, BS25+1,2)=\"DŽ\"),BS25+2,BS25+1)","v":68},{"$f":"IF(OR(MID($B24, BT25+1,2)=\"NJ\",MID($B24, BT25+1,2)=\"LJ\",MID($B24, BT25+1,2)=\"DŽ\"),BT25+2,BT25+1)","v":69},{"$f":"IF(OR(MID($B24, BU25+1,2)=\"NJ\",MID($B24, BU25+1,2)=\"LJ\",MID($B24, BU25+1,2)=\"DŽ\"),BU25+2,BU25+1)","v":70}]
[13,null,0,13,{"$f":"IF(OR(LEFT(B26, 2) =\"NJ\", LEFT(B26, 2) =\"LJ\", LEFT(B26, 2) =\"DŽ\"), LEFT(B26, 2), LEFT(B26, 1))","v":""},{"$f":"IF(OR(MID($B26, E27+1,2) =\"NJ\", MID($B26, E27+1,2) =\"LJ\", MID($B26, E27+1,2) =\"DŽ\"), MID($B26, E27+1,2),MID($B26, E27+1,1))","v":""},"","","","","","","","","","","","","","","","","","","","","","","","","","","","","","","","","","","","","","","","","","","","","","","","","","","","","","","","","","","","","","","","","","","",""]
[null,null,null,null,{"$f":"IF(OR(LEFT(B26, 2) =\"NJ\", LEFT(B26, 2) =\"LJ\", LEFT(B26, 2) =\"DŽ\"),2,1)","v":1},{"$f":"IF(OR(MID($B26, E27+1,2)=\"NJ\",MID($B26, E27+1,2)=\"LJ\",MID($B26, E27+1,2)=\"DŽ\"),E27+2,E27+1)","v":2},{"$f":"IF(OR(MID($B26, F27+1,2)=\"NJ\",MID($B26, F27+1,2)=\"LJ\",MID($B26, F27+1,2)=\"DŽ\"),F27+2,F27+1)","v":3},{"$f":"IF(OR(MID($B26, G27+1,2)=\"NJ\",MID($B26, G27+1,2)=\"LJ\",MID($B26, G27+1,2)=\"DŽ\"),G27+2,G27+1)","v":4},{"$f":"IF(OR(MID($B26, H27+1,2)=\"NJ\",MID($B26, H27+1,2)=\"LJ\",MID($B26, H27+1,2)=\"DŽ\"),H27+2,H27+1)","v":5},{"$f":"IF(OR(MID($B26, I27+1,2)=\"NJ\",MID($B26, I27+1,2)=\"LJ\",MID($B26, I27+1,2)=\"DŽ\"),I27+2,I27+1)","v":6},{"$f":"IF(OR(MID($B26, J27+1,2)=\"NJ\",MID($B26, J27+1,2)=\"LJ\",MID($B26, J27+1,2)=\"DŽ\"),J27+2,J27+1)","v":7},{"$f":"IF(OR(MID($B26, K27+1,2)=\"NJ\",MID($B26, K27+1,2)=\"LJ\",MID($B26, K27+1,2)=\"DŽ\"),K27+2,K27+1)","v":8},{"$f":"IF(OR(MID($B26, L27+1,2)=\"NJ\",MID($B26, L27+1,2)=\"LJ\",MID($B26, L27+1,2)=\"DŽ\"),L27+2,L27+1)","v":9},{"$f":"IF(OR(MID($B26, M27+1,2)=\"NJ\",MID($B26, M27+1,2)=\"LJ\",MID($B26, M27+1,2)=\"DŽ\"),M27+2,M27+1)","v":10},{"$f":"IF(OR(MID($B26, N27+1,2)=\"NJ\",MID($B26, N27+1,2)=\"LJ\",MID($B26, N27+1,2)=\"DŽ\"),N27+2,N27+1)","v":11},{"$f":"IF(OR(MID($B26, O27+1,2)=\"NJ\",MID($B26, O27+1,2)=\"LJ\",MID($B26, O27+1,2)=\"DŽ\"),O27+2,O27+1)","v":12},{"$f":"IF(OR(MID($B26, P27+1,2)=\"NJ\",MID($B26, P27+1,2)=\"LJ\",MID($B26, P27+1,2)=\"DŽ\"),P27+2,P27+1)","v":13},{"$f":"IF(OR(MID($B26, Q27+1,2)=\"NJ\",MID($B26, Q27+1,2)=\"LJ\",MID($B26, Q27+1,2)=\"DŽ\"),Q27+2,Q27+1)","v":14},{"$f":"IF(OR(MID($B26, R27+1,2)=\"NJ\",MID($B26, R27+1,2)=\"LJ\",MID($B26, R27+1,2)=\"DŽ\"),R27+2,R27+1)","v":15},{"$f":"IF(OR(MID($B26, S27+1,2)=\"NJ\",MID($B26, S27+1,2)=\"LJ\",MID($B26, S27+1,2)=\"DŽ\"),S27+2,S27+1)","v":16},{"$f":"IF(OR(MID($B26, T27+1,2)=\"NJ\",MID($B26, T27+1,2)=\"LJ\",MID($B26, T27+1,2)=\"DŽ\"),T27+2,T27+1)","v":17},{"$f":"IF(OR(MID($B26, U27+1,2)=\"NJ\",MID($B26, U27+1,2)=\"LJ\",MID($B26, U27+1,2)=\"DŽ\"),U27+2,U27+1)","v":18},{"$f":"IF(OR(MID($B26, V27+1,2)=\"NJ\",MID($B26, V27+1,2)=\"LJ\",MID($B26, V27+1,2)=\"DŽ\"),V27+2,V27+1)","v":19},{"$f":"IF(OR(MID($B26, W27+1,2)=\"NJ\",MID($B26, W27+1,2)=\"LJ\",MID($B26, W27+1,2)=\"DŽ\"),W27+2,W27+1)","v":20},{"$f":"IF(OR(MID($B26, X27+1,2)=\"NJ\",MID($B26, X27+1,2)=\"LJ\",MID($B26, X27+1,2)=\"DŽ\"),X27+2,X27+1)","v":21},{"$f":"IF(OR(MID($B26, Y27+1,2)=\"NJ\",MID($B26, Y27+1,2)=\"LJ\",MID($B26, Y27+1,2)=\"DŽ\"),Y27+2,Y27+1)","v":22},{"$f":"IF(OR(MID($B26, Z27+1,2)=\"NJ\",MID($B26, Z27+1,2)=\"LJ\",MID($B26, Z27+1,2)=\"DŽ\"),Z27+2,Z27+1)","v":23},{"$f":"IF(OR(MID($B26, AA27+1,2)=\"NJ\",MID($B26, AA27+1,2)=\"LJ\",MID($B26, AA27+1,2)=\"DŽ\"),AA27+2,AA27+1)","v":24},{"$f":"IF(OR(MID($B26, AB27+1,2)=\"NJ\",MID($B26, AB27+1,2)=\"LJ\",MID($B26, AB27+1,2)=\"DŽ\"),AB27+2,AB27+1)","v":25},{"$f":"IF(OR(MID($B26, AC27+1,2)=\"NJ\",MID($B26, AC27+1,2)=\"LJ\",MID($B26, AC27+1,2)=\"DŽ\"),AC27+2,AC27+1)","v":26},{"$f":"IF(OR(MID($B26, AD27+1,2)=\"NJ\",MID($B26, AD27+1,2)=\"LJ\",MID($B26, AD27+1,2)=\"DŽ\"),AD27+2,AD27+1)","v":27},{"$f":"IF(OR(MID($B26, AE27+1,2)=\"NJ\",MID($B26, AE27+1,2)=\"LJ\",MID($B26, AE27+1,2)=\"DŽ\"),AE27+2,AE27+1)","v":28},{"$f":"IF(OR(MID($B26, AF27+1,2)=\"NJ\",MID($B26, AF27+1,2)=\"LJ\",MID($B26, AF27+1,2)=\"DŽ\"),AF27+2,AF27+1)","v":29},{"$f":"IF(OR(MID($B26, AG27+1,2)=\"NJ\",MID($B26, AG27+1,2)=\"LJ\",MID($B26, AG27+1,2)=\"DŽ\"),AG27+2,AG27+1)","v":30},{"$f":"IF(OR(MID($B26, AH27+1,2)=\"NJ\",MID($B26, AH27+1,2)=\"LJ\",MID($B26, AH27+1,2)=\"DŽ\"),AH27+2,AH27+1)","v":31},{"$f":"IF(OR(MID($B26, AI27+1,2)=\"NJ\",MID($B26, AI27+1,2)=\"LJ\",MID($B26, AI27+1,2)=\"DŽ\"),AI27+2,AI27+1)","v":32},{"$f":"IF(OR(MID($B26, AJ27+1,2)=\"NJ\",MID($B26, AJ27+1,2)=\"LJ\",MID($B26, AJ27+1,2)=\"DŽ\"),AJ27+2,AJ27+1)","v":33},{"$f":"IF(OR(MID($B26, AK27+1,2)=\"NJ\",MID($B26, AK27+1,2)=\"LJ\",MID($B26, AK27+1,2)=\"DŽ\"),AK27+2,AK27+1)","v":34},{"$f":"IF(OR(MID($B26, AL27+1,2)=\"NJ\",MID($B26, AL27+1,2)=\"LJ\",MID($B26, AL27+1,2)=\"DŽ\"),AL27+2,AL27+1)","v":35},{"$f":"IF(OR(MID($B26, AM27+1,2)=\"NJ\",MID($B26, AM27+1,2)=\"LJ\",MID($B26, AM27+1,2)=\"DŽ\"),AM27+2,AM27+1)","v":36},{"$f":"IF(OR(MID($B26, AN27+1,2)=\"NJ\",MID($B26, AN27+1,2)=\"LJ\",MID($B26, AN27+1,2)=\"DŽ\"),AN27+2,AN27+1)","v":37},{"$f":"IF(OR(MID($B26, AO27+1,2)=\"NJ\",MID($B26, AO27+1,2)=\"LJ\",MID($B26, AO27+1,2)=\"DŽ\"),AO27+2,AO27+1)","v":38},{"$f":"IF(OR(MID($B26, AP27+1,2)=\"NJ\",MID($B26, AP27+1,2)=\"LJ\",MID($B26, AP27+1,2)=\"DŽ\"),AP27+2,AP27+1)","v":39},{"$f":"IF(OR(MID($B26, AQ27+1,2)=\"NJ\",MID($B26, AQ27+1,2)=\"LJ\",MID($B26, AQ27+1,2)=\"DŽ\"),AQ27+2,AQ27+1)","v":40},{"$f":"IF(OR(MID($B26, AR27+1,2)=\"NJ\",MID($B26, AR27+1,2)=\"LJ\",MID($B26, AR27+1,2)=\"DŽ\"),AR27+2,AR27+1)","v":41},{"$f":"IF(OR(MID($B26, AS27+1,2)=\"NJ\",MID($B26, AS27+1,2)=\"LJ\",MID($B26, AS27+1,2)=\"DŽ\"),AS27+2,AS27+1)","v":42},{"$f":"IF(OR(MID($B26, AT27+1,2)=\"NJ\",MID($B26, AT27+1,2)=\"LJ\",MID($B26, AT27+1,2)=\"DŽ\"),AT27+2,AT27+1)","v":43},{"$f":"IF(OR(MID($B26, AU27+1,2)=\"NJ\",MID($B26, AU27+1,2)=\"LJ\",MID($B26, AU27+1,2)=\"DŽ\"),AU27+2,AU27+1)","v":44},{"$f":"IF(OR(MID($B26, AV27+1,2)=\"NJ\",MID($B26, AV27+1,2)=\"LJ\",MID($B26, AV27+1,2)=\"DŽ\"),AV27+2,AV27+1)","v":45},{"$f":"IF(OR(MID($B26, AW27+1,2)=\"NJ\",MID($B26, AW27+1,2)=\"LJ\",MID($B26, AW27+1,2)=\"DŽ\"),AW27+2,AW27+1)","v":46},{"$f":"IF(OR(MID($B26, AX27+1,2)=\"NJ\",MID($B26, AX27+1,2)=\"LJ\",MID($B26, AX27+1,2)=\"DŽ\"),AX27+2,AX27+1)","v":47},{"$f":"IF(OR(MID($B26, AY27+1,2)=\"NJ\",MID($B26, AY27+1,2)=\"LJ\",MID($B26, AY27+1,2)=\"DŽ\"),AY27+2,AY27+1)","v":48},{"$f":"IF(OR(MID($B26, AZ27+1,2)=\"NJ\",MID($B26, AZ27+1,2)=\"LJ\",MID($B26, AZ27+1,2)=\"DŽ\"),AZ27+2,AZ27+1)","v":49},{"$f":"IF(OR(MID($B26, BA27+1,2)=\"NJ\",MID($B26, BA27+1,2)=\"LJ\",MID($B26, BA27+1,2)=\"DŽ\"),BA27+2,BA27+1)","v":50},{"$f":"IF(OR(MID($B26, BB27+1,2)=\"NJ\",MID($B26, BB27+1,2)=\"LJ\",MID($B26, BB27+1,2)=\"DŽ\"),BB27+2,BB27+1)","v":51},{"$f":"IF(OR(MID($B26, BC27+1,2)=\"NJ\",MID($B26, BC27+1,2)=\"LJ\",MID($B26, BC27+1,2)=\"DŽ\"),BC27+2,BC27+1)","v":52},{"$f":"IF(OR(MID($B26, BD27+1,2)=\"NJ\",MID($B26, BD27+1,2)=\"LJ\",MID($B26, BD27+1,2)=\"DŽ\"),BD27+2,BD27+1)","v":53},{"$f":"IF(OR(MID($B26, BE27+1,2)=\"NJ\",MID($B26, BE27+1,2)=\"LJ\",MID($B26, BE27+1,2)=\"DŽ\"),BE27+2,BE27+1)","v":54},{"$f":"IF(OR(MID($B26, BF27+1,2)=\"NJ\",MID($B26, BF27+1,2)=\"LJ\",MID($B26, BF27+1,2)=\"DŽ\"),BF27+2,BF27+1)","v":55},{"$f":"IF(OR(MID($B26, BG27+1,2)=\"NJ\",MID($B26, BG27+1,2)=\"LJ\",MID($B26, BG27+1,2)=\"DŽ\"),BG27+2,BG27+1)","v":56},{"$f":"IF(OR(MID($B26, BH27+1,2)=\"NJ\",MID($B26, BH27+1,2)=\"LJ\",MID($B26, BH27+1,2)=\"DŽ\"),BH27+2,BH27+1)","v":57},{"$f":"IF(OR(MID($B26, BI27+1,2)=\"NJ\",MID($B26, BI27+1,2)=\"LJ\",MID($B26, BI27+1,2)=\"DŽ\"),BI27+2,BI27+1)","v":58},{"$f":"IF(OR(MID($B26, BJ27+1,2)=\"NJ\",MID($B26, BJ27+1,2)=\"LJ\",MID($B26, BJ27+1,2)=\"DŽ\"),BJ27+2,BJ27+1)","v":59},{"$f":"IF(OR(MID($B26, BK27+1,2)=\"NJ\",MID($B26, BK27+1,2)=\"LJ\",MID($B26, BK27+1,2)=\"DŽ\"),BK27+2,BK27+1)","v":60},{"$f":"IF(OR(MID($B26, BL27+1,2)=\"NJ\",MID($B26, BL27+1,2)=\"LJ\",MID($B26, BL27+1,2)=\"DŽ\"),BL27+2,BL27+1)","v":61},{"$f":"IF(OR(MID($B26, BM27+1,2)=\"NJ\",MID($B26, BM27+1,2)=\"LJ\",MID($B26, BM27+1,2)=\"DŽ\"),BM27+2,BM27+1)","v":62},{"$f":"IF(OR(MID($B26, BN27+1,2)=\"NJ\",MID($B26, BN27+1,2)=\"LJ\",MID($B26, BN27+1,2)=\"DŽ\"),BN27+2,BN27+1)","v":63},{"$f":"IF(OR(MID($B26, BO27+1,2)=\"NJ\",MID($B26, BO27+1,2)=\"LJ\",MID($B26, BO27+1,2)=\"DŽ\"),BO27+2,BO27+1)","v":64},{"$f":"IF(OR(MID($B26, BP27+1,2)=\"NJ\",MID($B26, BP27+1,2)=\"LJ\",MID($B26, BP27+1,2)=\"DŽ\"),BP27+2,BP27+1)","v":65},{"$f":"IF(OR(MID($B26, BQ27+1,2)=\"NJ\",MID($B26, BQ27+1,2)=\"LJ\",MID($B26, BQ27+1,2)=\"DŽ\"),BQ27+2,BQ27+1)","v":66},{"$f":"IF(OR(MID($B26, BR27+1,2)=\"NJ\",MID($B26, BR27+1,2)=\"LJ\",MID($B26, BR27+1,2)=\"DŽ\"),BR27+2,BR27+1)","v":67},{"$f":"IF(OR(MID($B26, BS27+1,2)=\"NJ\",MID($B26, BS27+1,2)=\"LJ\",MID($B26, BS27+1,2)=\"DŽ\"),BS27+2,BS27+1)","v":68},{"$f":"IF(OR(MID($B26, BT27+1,2)=\"NJ\",MID($B26, BT27+1,2)=\"LJ\",MID($B26, BT27+1,2)=\"DŽ\"),BT27+2,BT27+1)","v":69},{"$f":"IF(OR(MID($B26, BU27+1,2)=\"NJ\",MID($B26, BU27+1,2)=\"LJ\",MID($B26, BU27+1,2)=\"DŽ\"),BU27+2,BU27+1)","v":70}]
[14,null,0,14,{"$f":"IF(OR(LEFT(B28, 2) =\"NJ\", LEFT(B28, 2) =\"LJ\", LEFT(B28, 2) =\"DŽ\"), LEFT(B28, 2), LEFT(B28, 1))","v":""},{"$f":"IF(OR(MID($B28, E29+1,2) =\"NJ\", MID($B28, E29+1,2) =\"LJ\", MID($B28, E29+1,2) =\"DŽ\"), MID($B28, E29+1,2),MID($B28, E29+1,1))","v":""},"","","","","","","","","","","","","","","","","","","","","","","","","","","","","","","","","","","","","","","","","","","","","","","","","","","","","","","","","","","","","","","","","","","",""]
[null,null,null,null,{"$f":"IF(OR(LEFT(B28, 2) =\"NJ\", LEFT(B28, 2) =\"LJ\", LEFT(B28, 2) =\"DŽ\"),2,1)","v":1},{"$f":"IF(OR(MID($B28, E29+1,2)=\"NJ\",MID($B28, E29+1,2)=\"LJ\",MID($B28, E29+1,2)=\"DŽ\"),E29+2,E29+1)","v":2},{"$f":"IF(OR(MID($B28, F29+1,2)=\"NJ\",MID($B28, F29+1,2)=\"LJ\",MID($B28, F29+1,2)=\"DŽ\"),F29+2,F29+1)","v":3},{"$f":"IF(OR(MID($B28, G29+1,2)=\"NJ\",MID($B28, G29+1,2)=\"LJ\",MID($B28, G29+1,2)=\"DŽ\"),G29+2,G29+1)","v":4},{"$f":"IF(OR(MID($B28, H29+1,2)=\"NJ\",MID($B28, H29+1,2)=\"LJ\",MID($B28, H29+1,2)=\"DŽ\"),H29+2,H29+1)","v":5},{"$f":"IF(OR(MID($B28, I29+1,2)=\"NJ\",MID($B28, I29+1,2)=\"LJ\",MID($B28, I29+1,2)=\"DŽ\"),I29+2,I29+1)","v":6},{"$f":"IF(OR(MID($B28, J29+1,2)=\"NJ\",MID($B28, J29+1,2)=\"LJ\",MID($B28, J29+1,2)=\"DŽ\"),J29+2,J29+1)","v":7},{"$f":"IF(OR(MID($B28, K29+1,2)=\"NJ\",MID($B28, K29+1,2)=\"LJ\",MID($B28, K29+1,2)=\"DŽ\"),K29+2,K29+1)","v":8},{"$f":"IF(OR(MID($B28, L29+1,2)=\"NJ\",MID($B28, L29+1,2)=\"LJ\",MID($B28, L29+1,2)=\"DŽ\"),L29+2,L29+1)","v":9},{"$f":"IF(OR(MID($B28, M29+1,2)=\"NJ\",MID($B28, M29+1,2)=\"LJ\",MID($B28, M29+1,2)=\"DŽ\"),M29+2,M29+1)","v":10},{"$f":"IF(OR(MID($B28, N29+1,2)=\"NJ\",MID($B28, N29+1,2)=\"LJ\",MID($B28, N29+1,2)=\"DŽ\"),N29+2,N29+1)","v":11},{"$f":"IF(OR(MID($B28, O29+1,2)=\"NJ\",MID($B28, O29+1,2)=\"LJ\",MID($B28, O29+1,2)=\"DŽ\"),O29+2,O29+1)","v":12},{"$f":"IF(OR(MID($B28, P29+1,2)=\"NJ\",MID($B28, P29+1,2)=\"LJ\",MID($B28, P29+1,2)=\"DŽ\"),P29+2,P29+1)","v":13},{"$f":"IF(OR(MID($B28, Q29+1,2)=\"NJ\",MID($B28, Q29+1,2)=\"LJ\",MID($B28, Q29+1,2)=\"DŽ\"),Q29+2,Q29+1)","v":14},{"$f":"IF(OR(MID($B28, R29+1,2)=\"NJ\",MID($B28, R29+1,2)=\"LJ\",MID($B28, R29+1,2)=\"DŽ\"),R29+2,R29+1)","v":15},{"$f":"IF(OR(MID($B28, S29+1,2)=\"NJ\",MID($B28, S29+1,2)=\"LJ\",MID($B28, S29+1,2)=\"DŽ\"),S29+2,S29+1)","v":16},{"$f":"IF(OR(MID($B28, T29+1,2)=\"NJ\",MID($B28, T29+1,2)=\"LJ\",MID($B28, T29+1,2)=\"DŽ\"),T29+2,T29+1)","v":17},{"$f":"IF(OR(MID($B28, U29+1,2)=\"NJ\",MID($B28, U29+1,2)=\"LJ\",MID($B28, U29+1,2)=\"DŽ\"),U29+2,U29+1)","v":18},{"$f":"IF(OR(MID($B28, V29+1,2)=\"NJ\",MID($B28, V29+1,2)=\"LJ\",MID($B28, V29+1,2)=\"DŽ\"),V29+2,V29+1)","v":19},{"$f":"IF(OR(MID($B28, W29+1,2)=\"NJ\",MID($B28, W29+1,2)=\"LJ\",MID($B28, W29+1,2)=\"DŽ\"),W29+2,W29+1)","v":20},{"$f":"IF(OR(MID($B28, X29+1,2)=\"NJ\",MID($B28, X29+1,2)=\"LJ\",MID($B28, X29+1,2)=\"DŽ\"),X29+2,X29+1)","v":21},{"$f":"IF(OR(MID($B28, Y29+1,2)=\"NJ\",MID($B28, Y29+1,2)=\"LJ\",MID($B28, Y29+1,2)=\"DŽ\"),Y29+2,Y29+1)","v":22},{"$f":"IF(OR(MID($B28, Z29+1,2)=\"NJ\",MID($B28, Z29+1,2)=\"LJ\",MID($B28, Z29+1,2)=\"DŽ\"),Z29+2,Z29+1)","v":23},{"$f":"IF(OR(MID($B28, AA29+1,2)=\"NJ\",MID($B28, AA29+1,2)=\"LJ\",MID($B28, AA29+1,2)=\"DŽ\"),AA29+2,AA29+1)","v":24},{"$f":"IF(OR(MID($B28, AB29+1,2)=\"NJ\",MID($B28, AB29+1,2)=\"LJ\",MID($B28, AB29+1,2)=\"DŽ\"),AB29+2,AB29+1)","v":25},{"$f":"IF(OR(MID($B28, AC29+1,2)=\"NJ\",MID($B28, AC29+1,2)=\"LJ\",MID($B28, AC29+1,2)=\"DŽ\"),AC29+2,AC29+1)","v":26},{"$f":"IF(OR(MID($B28, AD29+1,2)=\"NJ\",MID($B28, AD29+1,2)=\"LJ\",MID($B28, AD29+1,2)=\"DŽ\"),AD29+2,AD29+1)","v":27},{"$f":"IF(OR(MID($B28, AE29+1,2)=\"NJ\",MID($B28, AE29+1,2)=\"LJ\",MID($B28, AE29+1,2)=\"DŽ\"),AE29+2,AE29+1)","v":28},{"$f":"IF(OR(MID($B28, AF29+1,2)=\"NJ\",MID($B28, AF29+1,2)=\"LJ\",MID($B28, AF29+1,2)=\"DŽ\"),AF29+2,AF29+1)","v":29},{"$f":"IF(OR(MID($B28, AG29+1,2)=\"NJ\",MID($B28, AG29+1,2)=\"LJ\",MID($B28, AG29+1,2)=\"DŽ\"),AG29+2,AG29+1)","v":30},{"$f":"IF(OR(MID($B28, AH29+1,2)=\"NJ\",MID($B28, AH29+1,2)=\"LJ\",MID($B28, AH29+1,2)=\"DŽ\"),AH29+2,AH29+1)","v":31},{"$f":"IF(OR(MID($B28, AI29+1,2)=\"NJ\",MID($B28, AI29+1,2)=\"LJ\",MID($B28, AI29+1,2)=\"DŽ\"),AI29+2,AI29+1)","v":32},{"$f":"IF(OR(MID($B28, AJ29+1,2)=\"NJ\",MID($B28, AJ29+1,2)=\"LJ\",MID($B28, AJ29+1,2)=\"DŽ\"),AJ29+2,AJ29+1)","v":33},{"$f":"IF(OR(MID($B28, AK29+1,2)=\"NJ\",MID($B28, AK29+1,2)=\"LJ\",MID($B28, AK29+1,2)=\"DŽ\"),AK29+2,AK29+1)","v":34},{"$f":"IF(OR(MID($B28, AL29+1,2)=\"NJ\",MID($B28, AL29+1,2)=\"LJ\",MID($B28, AL29+1,2)=\"DŽ\"),AL29+2,AL29+1)","v":35},{"$f":"IF(OR(MID($B28, AM29+1,2)=\"NJ\",MID($B28, AM29+1,2)=\"LJ\",MID($B28, AM29+1,2)=\"DŽ\"),AM29+2,AM29+1)","v":36},{"$f":"IF(OR(MID($B28, AN29+1,2)=\"NJ\",MID($B28, AN29+1,2)=\"LJ\",MID($B28, AN29+1,2)=\"DŽ\"),AN29+2,AN29+1)","v":37},{"$f":"IF(OR(MID($B28, AO29+1,2)=\"NJ\",MID($B28, AO29+1,2)=\"LJ\",MID($B28, AO29+1,2)=\"DŽ\"),AO29+2,AO29+1)","v":38},{"$f":"IF(OR(MID($B28, AP29+1,2)=\"NJ\",MID($B28, AP29+1,2)=\"LJ\",MID($B28, AP29+1,2)=\"DŽ\"),AP29+2,AP29+1)","v":39},{"$f":"IF(OR(MID($B28, AQ29+1,2)=\"NJ\",MID($B28, AQ29+1,2)=\"LJ\",MID($B28, AQ29+1,2)=\"DŽ\"),AQ29+2,AQ29+1)","v":40},{"$f":"IF(OR(MID($B28, AR29+1,2)=\"NJ\",MID($B28, AR29+1,2)=\"LJ\",MID($B28, AR29+1,2)=\"DŽ\"),AR29+2,AR29+1)","v":41},{"$f":"IF(OR(MID($B28, AS29+1,2)=\"NJ\",MID($B28, AS29+1,2)=\"LJ\",MID($B28, AS29+1,2)=\"DŽ\"),AS29+2,AS29+1)","v":42},{"$f":"IF(OR(MID($B28, AT29+1,2)=\"NJ\",MID($B28, AT29+1,2)=\"LJ\",MID($B28, AT29+1,2)=\"DŽ\"),AT29+2,AT29+1)","v":43},{"$f":"IF(OR(MID($B28, AU29+1,2)=\"NJ\",MID($B28, AU29+1,2)=\"LJ\",MID($B28, AU29+1,2)=\"DŽ\"),AU29+2,AU29+1)","v":44},{"$f":"IF(OR(MID($B28, AV29+1,2)=\"NJ\",MID($B28, AV29+1,2)=\"LJ\",MID($B28, AV29+1,2)=\"DŽ\"),AV29+2,AV29+1)","v":45},{"$f":"IF(OR(MID($B28, AW29+1,2)=\"NJ\",MID($B28, AW29+1,2)=\"LJ\",MID($B28, AW29+1,2)=\"DŽ\"),AW29+2,AW29+1)","v":46},{"$f":"IF(OR(MID($B28, AX29+1,2)=\"NJ\",MID($B28, AX29+1,2)=\"LJ\",MID($B28, AX29+1,2)=\"DŽ\"),AX29+2,AX29+1)","v":47},{"$f":"IF(OR(MID($B28, AY29+1,2)=\"NJ\",MID($B28, AY29+1,2)=\"LJ\",MID($B28, AY29+1,2)=\"DŽ\"),AY29+2,AY29+1)","v":48},{"$f":"IF(OR(MID($B28, AZ29+1,2)=\"NJ\",MID($B28, AZ29+1,2)=\"LJ\",MID($B28, AZ29+1,2)=\"DŽ\"),AZ29+2,AZ29+1)","v":49},{"$f":"IF(OR(MID($B28, BA29+1,2)=\"NJ\",MID($B28, BA29+1,2)=\"LJ\",MID($B28, BA29+1,2)=\"DŽ\"),BA29+2,BA29+1)","v":50},{"$f":"IF(OR(MID($B28, BB29+1,2)=\"NJ\",MID($B28, BB29+1,2)=\"LJ\",MID($B28, BB29+1,2)=\"DŽ\"),BB29+2,BB29+1)","v":51},{"$f":"IF(OR(MID($B28, BC29+1,2)=\"NJ\",MID($B28, BC29+1,2)=\"LJ\",MID($B28, BC29+1,2)=\"DŽ\"),BC29+2,BC29+1)","v":52},{"$f":"IF(OR(MID($B28, BD29+1,2)=\"NJ\",MID($B28, BD29+1,2)=\"LJ\",MID($B28, BD29+1,2)=\"DŽ\"),BD29+2,BD29+1)","v":53},{"$f":"IF(OR(MID($B28, BE29+1,2)=\"NJ\",MID($B28, BE29+1,2)=\"LJ\",MID($B28, BE29+1,2)=\"DŽ\"),BE29+2,BE29+1)","v":54},{"$f":"IF(OR(MID($B28, BF29+1,2)=\"NJ\",MID($B28, BF29+1,2)=\"LJ\",MID($B28, BF29+1,2)=\"DŽ\"),BF29+2,BF29+1)","v":55},{"$f":"IF(OR(MID($B28, BG29+1,2)=\"NJ\",MID($B28, BG29+1,2)=\"LJ\",MID($B28, BG29+1,2)=\"DŽ\"),BG29+2,BG29+1)","v":56},{"$f":"IF(OR(MID($B28, BH29+1,2)=\"NJ\",MID($B28, BH29+1,2)=\"LJ\",MID($B28, BH29+1,2)=\"DŽ\"),BH29+2,BH29+1)","v":57},{"$f":"IF(OR(MID($B28, BI29+1,2)=\"NJ\",MID($B28, BI29+1,2)=\"LJ\",MID($B28, BI29+1,2)=\"DŽ\"),BI29+2,BI29+1)","v":58},{"$f":"IF(OR(MID($B28, BJ29+1,2)=\"NJ\",MID($B28, BJ29+1,2)=\"LJ\",MID($B28, BJ29+1,2)=\"DŽ\"),BJ29+2,BJ29+1)","v":59},{"$f":"IF(OR(MID($B28, BK29+1,2)=\"NJ\",MID($B28, BK29+1,2)=\"LJ\",MID($B28, BK29+1,2)=\"DŽ\"),BK29+2,BK29+1)","v":60},{"$f":"IF(OR(MID($B28, BL29+1,2)=\"NJ\",MID($B28, BL29+1,2)=\"LJ\",MID($B28, BL29+1,2)=\"DŽ\"),BL29+2,BL29+1)","v":61},{"$f":"IF(OR(MID($B28, BM29+1,2)=\"NJ\",MID($B28, BM29+1,2)=\"LJ\",MID($B28, BM29+1,2)=\"DŽ\"),BM29+2,BM29+1)","v":62},{"$f":"IF(OR(MID($B28, BN29+1,2)=\"NJ\",MID($B28, BN29+1,2)=\"LJ\",MID($B28, BN29+1,2)=\"DŽ\"),BN29+2,BN29+1)","v":63},{"$f":"IF(OR(MID($B28, BO29+1,2)=\"NJ\",MID($B28, BO29+1,2)=\"LJ\",MID($B28, BO29+1,2)=\"DŽ\"),BO29+2,BO29+1)","v":64},{"$f":"IF(OR(MID($B28, BP29+1,2)=\"NJ\",MID($B28, BP29+1,2)=\"LJ\",MID($B28, BP29+1,2)=\"DŽ\"),BP29+2,BP29+1)","v":65},{"$f":"IF(OR(MID($B28, BQ29+1,2)=\"NJ\",MID($B28, BQ29+1,2)=\"LJ\",MID($B28, BQ29+1,2)=\"DŽ\"),BQ29+2,BQ29+1)","v":66},{"$f":"IF(OR(MID($B28, BR29+1,2)=\"NJ\",MID($B28, BR29+1,2)=\"LJ\",MID($B28, BR29+1,2)=\"DŽ\"),BR29+2,BR29+1)","v":67},{"$f":"IF(OR(MID($B28, BS29+1,2)=\"NJ\",MID($B28, BS29+1,2)=\"LJ\",MID($B28, BS29+1,2)=\"DŽ\"),BS29+2,BS29+1)","v":68},{"$f":"IF(OR(MID($B28, BT29+1,2)=\"NJ\",MID($B28, BT29+1,2)=\"LJ\",MID($B28, BT29+1,2)=\"DŽ\"),BT29+2,BT29+1)","v":69},{"$f":"IF(OR(MID($B28, BU29+1,2)=\"NJ\",MID($B28, BU29+1,2)=\"LJ\",MID($B28, BU29+1,2)=\"DŽ\"),BU29+2,BU29+1)","v":70}]
[15,null,0,15,{"$f":"IF(OR(LEFT(B30, 2) =\"NJ\", LEFT(B30, 2) =\"LJ\", LEFT(B30, 2) =\"DŽ\"), LEFT(B30, 2), LEFT(B30, 1))","v":""},{"$f":"IF(OR(MID($B30, E31+1,2) =\"NJ\", MID($B30, E31+1,2) =\"LJ\", MID($B30, E31+1,2) =\"DŽ\"), MID($B30, E31+1,2),MID($B30, E31+1,1))","v":""},"","","","","","","","","","","","","","","","","","","","","","","","","","","","","","","","","","","","","","","","","","","","","","","","","","","","","","","","","","","","","","",{"$f":"IF(OR(MID($B30, BP31+1,2) =\"NJ\", MID($B30, BP31+1,2) =\"LJ\", MID($B30, BP31+1,2) =\"DŽ\"), MID($B30, BP31+1,2),MID($B30, BP31+1,1))","v":""},"","","","",""]
[null,null,null,null,{"$f":"IF(OR(LEFT(B30, 2) =\"NJ\", LEFT(B30, 2) =\"LJ\", LEFT(B30, 2) =\"DŽ\"),2,1)","v":1},{"$f":"IF(OR(MID($B30, E31+1,2)=\"NJ\",MID($B30, E31+1,2)=\"LJ\",MID($B30, E31+1,2)=\"DŽ\"),E31+2,E31+1)","v":2},{"$f":"IF(OR(MID($B30, F31+1,2)=\"NJ\",MID($B30, F31+1,2)=\"LJ\",MID($B30, F31+1,2)=\"DŽ\"),F31+2,F31+1)","v":3},{"$f":"IF(OR(MID($B30, G31+1,2)=\"NJ\",MID($B30, G31+1,2)=\"LJ\",MID($B30, G31+1,2)=\"DŽ\"),G31+2,G31+1)","v":4},{"$f":"IF(OR(MID($B30, H31+1,2)=\"NJ\",MID($B30, H31+1,2)=\"LJ\",MID($B30, H31+1,2)=\"DŽ\"),H31+2,H31+1)","v":5},{"$f":"IF(OR(MID($B30, I31+1,2)=\"NJ\",MID($B30, I31+1,2)=\"LJ\",MID($B30, I31+1,2)=\"DŽ\"),I31+2,I31+1)","v":6},{"$f":"IF(OR(MID($B30, J31+1,2)=\"NJ\",MID($B30, J31+1,2)=\"LJ\",MID($B30, J31+1,2)=\"DŽ\"),J31+2,J31+1)","v":7},{"$f":"IF(OR(MID($B30, K31+1,2)=\"NJ\",MID($B30, K31+1,2)=\"LJ\",MID($B30, K31+1,2)=\"DŽ\"),K31+2,K31+1)","v":8},{"$f":"IF(OR(MID($B30, L31+1,2)=\"NJ\",MID($B30, L31+1,2)=\"LJ\",MID($B30, L31+1,2)=\"DŽ\"),L31+2,L31+1)","v":9},{"$f":"IF(OR(MID($B30, M31+1,2)=\"NJ\",MID($B30, M31+1,2)=\"LJ\",MID($B30, M31+1,2)=\"DŽ\"),M31+2,M31+1)","v":10},{"$f":"IF(OR(MID($B30, N31+1,2)=\"NJ\",MID($B30, N31+1,2)=\"LJ\",MID($B30, N31+1,2)=\"DŽ\"),N31+2,N31+1)","v":11},{"$f":"IF(OR(MID($B30, O31+1,2)=\"NJ\",MID($B30, O31+1,2)=\"LJ\",MID($B30, O31+1,2)=\"DŽ\"),O31+2,O31+1)","v":12},{"$f":"IF(OR(MID($B30, P31+1,2)=\"NJ\",MID($B30, P31+1,2)=\"LJ\",MID($B30, P31+1,2)=\"DŽ\"),P31+2,P31+1)","v":13},{"$f":"IF(OR(MID($B30, Q31+1,2)=\"NJ\",MID($B30, Q31+1,2)=\"LJ\",MID($B30, Q31+1,2)=\"DŽ\"),Q31+2,Q31+1)","v":14},{"$f":"IF(OR(MID($B30, R31+1,2)=\"NJ\",MID($B30, R31+1,2)=\"LJ\",MID($B30, R31+1,2)=\"DŽ\"),R31+2,R31+1)","v":15},{"$f":"IF(OR(MID($B30, S31+1,2)=\"NJ\",MID($B30, S31+1,2)=\"LJ\",MID($B30, S31+1,2)=\"DŽ\"),S31+2,S31+1)","v":16},{"$f":"IF(OR(MID($B30, T31+1,2)=\"NJ\",MID($B30, T31+1,2)=\"LJ\",MID($B30, T31+1,2)=\"DŽ\"),T31+2,T31+1)","v":17},{"$f":"IF(OR(MID($B30, U31+1,2)=\"NJ\",MID($B30, U31+1,2)=\"LJ\",MID($B30, U31+1,2)=\"DŽ\"),U31+2,U31+1)","v":18},{"$f":"IF(OR(MID($B30, V31+1,2)=\"NJ\",MID($B30, V31+1,2)=\"LJ\",MID($B30, V31+1,2)=\"DŽ\"),V31+2,V31+1)","v":19},{"$f":"IF(OR(MID($B30, W31+1,2)=\"NJ\",MID($B30, W31+1,2)=\"LJ\",MID($B30, W31+1,2)=\"DŽ\"),W31+2,W31+1)","v":20},{"$f":"IF(OR(MID($B30, X31+1,2)=\"NJ\",MID($B30, X31+1,2)=\"LJ\",MID($B30, X31+1,2)=\"DŽ\"),X31+2,X31+1)","v":21},{"$f":"IF(OR(MID($B30, Y31+1,2)=\"NJ\",MID($B30, Y31+1,2)=\"LJ\",MID($B30, Y31+1,2)=\"DŽ\"),Y31+2,Y31+1)","v":22},{"$f":"IF(OR(MID($B30, Z31+1,2)=\"NJ\",MID($B30, Z31+1,2)=\"LJ\",MID($B30, Z31+1,2)=\"DŽ\"),Z31+2,Z31+1)","v":23},{"$f":"IF(OR(MID($B30, AA31+1,2)=\"NJ\",MID($B30, AA31+1,2)=\"LJ\",MID($B30, AA31+1,2)=\"DŽ\"),AA31+2,AA31+1)","v":24},{"$f":"IF(OR(MID($B30, AB31+1,2)=\"NJ\",MID($B30, AB31+1,2)=\"LJ\",MID($B30, AB31+1,2)=\"DŽ\"),AB31+2,AB31+1)","v":25},{"$f":"IF(OR(MID($B30, AC31+1,2)=\"NJ\",MID($B30, AC31+1,2)=\"LJ\",MID($B30, AC31+1,2)=\"DŽ\"),AC31+2,AC31+1)","v":26},{"$f":"IF(OR(MID($B30, AD31+1,2)=\"NJ\",MID($B30, AD31+1,2)=\"LJ\",MID($B30, AD31+1,2)=\"DŽ\"),AD31+2,AD31+1)","v":27},{"$f":"IF(OR(MID($B30, AE31+1,2)=\"NJ\",MID($B30, AE31+1,2)=\"LJ\",MID($B30, AE31+1,2)=\"DŽ\"),AE31+2,AE31+1)","v":28},{"$f":"IF(OR(MID($B30, AF31+1,2)=\"NJ\",MID($B30, AF31+1,2)=\"LJ\",MID($B30, AF31+1,2)=\"DŽ\"),AF31+2,AF31+1)","v":29},{"$f":"IF(OR(MID($B30, AG31+1,2)=\"NJ\",MID($B30, AG31+1,2)=\"LJ\",MID($B30, AG31+1,2)=\"DŽ\"),AG31+2,AG31+1)","v":30},{"$f":"IF(OR(MID($B30, AH31+1,2)=\"NJ\",MID($B30, AH31+1,2)=\"LJ\",MID($B30, AH31+1,2)=\"DŽ\"),AH31+2,AH31+1)","v":31},{"$f":"IF(OR(MID($B30, AI31+1,2)=\"NJ\",MID($B30, AI31+1,2)=\"LJ\",MID($B30, AI31+1,2)=\"DŽ\"),AI31+2,AI31+1)","v":32},{"$f":"IF(OR(MID($B30, AJ31+1,2)=\"NJ\",MID($B30, AJ31+1,2)=\"LJ\",MID($B30, AJ31+1,2)=\"DŽ\"),AJ31+2,AJ31+1)","v":33},{"$f":"IF(OR(MID($B30, AK31+1,2)=\"NJ\",MID($B30, AK31+1,2)=\"LJ\",MID($B30, AK31+1,2)=\"DŽ\"),AK31+2,AK31+1)","v":34},{"$f":"IF(OR(MID($B30, AL31+1,2)=\"NJ\",MID($B30, AL31+1,2)=\"LJ\",MID($B30, AL31+1,2)=\"DŽ\"),AL31+2,AL31+1)","v":35},{"$f":"IF(OR(MID($B30, AM31+1,2)=\"NJ\",MID($B30, AM31+1,2)=\"LJ\",MID($B30, AM31+1,2)=\"DŽ\"),AM31+2,AM31+1)","v":36},{"$f":"IF(OR(MID($B30, AN31+1,2)=\"NJ\",MID($B30, AN31+1,2)=\"LJ\",MID($B30, AN31+1,2)=\"DŽ\"),AN31+2,AN31+1)","v":37},{"$f":"IF(OR(MID($B30, AO31+1,2)=\"NJ\",MID($B30, AO31+1,2)=\"LJ\",MID($B30, AO31+1,2)=\"DŽ\"),AO31+2,AO31+1)","v":38},{"$f":"IF(OR(MID($B30, AP31+1,2)=\"NJ\",MID($B30, AP31+1,2)=\"LJ\",MID($B30, AP31+1,2)=\"DŽ\"),AP31+2,AP31+1)","v":39},{"$f":"IF(OR(MID($B30, AQ31+1,2)=\"NJ\",MID($B30, AQ31+1,2)=\"LJ\",MID($B30, AQ31+1,2)=\"DŽ\"),AQ31+2,AQ31+1)","v":40},{"$f":"IF(OR(MID($B30, AR31+1,2)=\"NJ\",MID($B30, AR31+1,2)=\"LJ\",MID($B30, AR31+1,2)=\"DŽ\"),AR31+2,AR31+1)","v":41},{"$f":"IF(OR(MID($B30, AS31+1,2)=\"NJ\",MID($B30, AS31+1,2)=\"LJ\",MID($B30, AS31+1,2)=\"DŽ\"),AS31+2,AS31+1)","v":42},{"$f":"IF(OR(MID($B30, AT31+1,2)=\"NJ\",MID($B30, AT31+1,2)=\"LJ\",MID($B30, AT31+1,2)=\"DŽ\"),AT31+2,AT31+1)","v":43},{"$f":"IF(OR(MID($B30, AU31+1,2)=\"NJ\",MID($B30, AU31+1,2)=\"LJ\",MID($B30, AU31+1,2)=\"DŽ\"),AU31+2,AU31+1)","v":44},{"$f":"IF(OR(MID($B30, AV31+1,2)=\"NJ\",MID($B30, AV31+1,2)=\"LJ\",MID($B30, AV31+1,2)=\"DŽ\"),AV31+2,AV31+1)","v":45},{"$f":"IF(OR(MID($B30, AW31+1,2)=\"NJ\",MID($B30, AW31+1,2)=\"LJ\",MID($B30, AW31+1,2)=\"DŽ\"),AW31+2,AW31+1)","v":46},{"$f":"IF(OR(MID($B30, AX31+1,2)=\"NJ\",MID($B30, AX31+1,2)=\"LJ\",MID($B30, AX31+1,2)=\"DŽ\"),AX31+2,AX31+1)","v":47},{"$f":"IF(OR(MID($B30, AY31+1,2)=\"NJ\",MID($B30, AY31+1,2)=\"LJ\",MID($B30, AY31+1,2)=\"DŽ\"),AY31+2,AY31+1)","v":48},{"$f":"IF(OR(MID($B30, AZ31+1,2)=\"NJ\",MID($B30, AZ31+1,2)=\"LJ\",MID($B30, AZ31+1,2)=\"DŽ\"),AZ31+2,AZ31+1)","v":49},{"$f":"IF(OR(MID($B30, BA31+1,2)=\"NJ\",MID($B30, BA31+1,2)=\"LJ\",MID($B30, BA31+1,2)=\"DŽ\"),BA31+2,BA31+1)","v":50},{"$f":"IF(OR(MID($B30, BB31+1,2)=\"NJ\",MID($B30, BB31+1,2)=\"LJ\",MID($B30, BB31+1,2)=\"DŽ\"),BB31+2,BB31+1)","v":51},{"$f":"IF(OR(MID($B30, BC31+1,2)=\"NJ\",MID($B30, BC31+1,2)=\"LJ\",MID($B30, BC31+1,2)=\"DŽ\"),BC31+2,BC31+1)","v":52},{"$f":"IF(OR(MID($B30, BD31+1,2)=\"NJ\",MID($B30, BD31+1,2)=\"LJ\",MID($B30, BD31+1,2)=\"DŽ\"),BD31+2,BD31+1)","v":53},{"$f":"IF(OR(MID($B30, BE31+1,2)=\"NJ\",MID($B30, BE31+1,2)=\"LJ\",MID($B30, BE31+1,2)=\"DŽ\"),BE31+2,BE31+1)","v":54},{"$f":"IF(OR(MID($B30, BF31+1,2)=\"NJ\",MID($B30, BF31+1,2)=\"LJ\",MID($B30, BF31+1,2)=\"DŽ\"),BF31+2,BF31+1)","v":55},{"$f":"IF(OR(MID($B30, BG31+1,2)=\"NJ\",MID($B30, BG31+1,2)=\"LJ\",MID($B30, BG31+1,2)=\"DŽ\"),BG31+2,BG31+1)","v":56},{"$f":"IF(OR(MID($B30, BH31+1,2)=\"NJ\",MID($B30, BH31+1,2)=\"LJ\",MID($B30, BH31+1,2)=\"DŽ\"),BH31+2,BH31+1)","v":57},{"$f":"IF(OR(MID($B30, BI31+1,2)=\"NJ\",MID($B30, BI31+1,2)=\"LJ\",MID($B30, BI31+1,2)=\"DŽ\"),BI31+2,BI31+1)","v":58},{"$f":"IF(OR(MID($B30, BJ31+1,2)=\"NJ\",MID($B30, BJ31+1,2)=\"LJ\",MID($B30, BJ31+1,2)=\"DŽ\"),BJ31+2,BJ31+1)","v":59},{"$f":"IF(OR(MID($B30, BK31+1,2)=\"NJ\",MID($B30, BK31+1,2)=\"LJ\",MID($B30, BK31+1,2)=\"DŽ\"),BK31+2,BK31+1)","v":60},{"$f":"IF(OR(MID($B30, BL31+1,2)=\"NJ\",MID($B30, BL31+1,2)=\"LJ\",MID($B30, BL31+1,2)=\"DŽ\"),BL31+2,BL31+1)","v":61},{"$f":"IF(OR(MID($B30, BM31+1,2)=\"NJ\",MID($B30, BM31+1,2)=\"LJ\",MID($B30, BM31+1,2)=\"DŽ\"),BM31+2,BM31+1)","v":62},{"$f":"IF(OR(MID($B30, BN31+1,2)=\"NJ\",MID($B30, BN31+1,2)=\"LJ\",MID($B30, BN31+1,2)=\"DŽ\"),BN31+2,BN31+1)","v":63},{"$f":"IF(OR(MID($B30, BO31+1,2)=\"NJ\",MID($B30, BO31+1,2)=\"LJ\",MID($B30, BO31+1,2)=\"DŽ\"),BO31+2,BO31+1)","v":64},{"$f":"IF(OR(MID($B30, BP31+1,2)=\"NJ\",MID($B30, BP31+1,2)=\"LJ\",MID($B30, BP31+1,2)=\"DŽ\"),BP31+2,BP31+1)","v":65},{"$f":"IF(OR(MID($B30, BQ31+1,2)=\"NJ\",MID($B30, BQ31+1,2)=\"LJ\",MID($B30, BQ31+1,2)=\"DŽ\"),BQ31+2,BQ31+1)","v":66},{"$f":"IF(OR(MID($B30, BR31+1,2)=\"NJ\",MID($B30, BR31+1,2)=\"LJ\",MID($B30, BR31+1,2)=\"DŽ\"),BR31+2,BR31+1)","v":67},{"$f":"IF(OR(MID($B30, BS31+1,2)=\"NJ\",MID($B30, BS31+1,2)=\"LJ\",MID($B30, BS31+1,2)=\"DŽ\"),BS31+2,BS31+1)","v":68},{"$f":"IF(OR(MID($B30, BT31+1,2)=\"NJ\",MID($B30, BT31+1,2)=\"LJ\",MID($B30, BT31+1,2)=\"DŽ\"),BT31+2,BT31+1)","v":69},{"$f":"IF(OR(MID($B30, BU31+1,2)=\"NJ\",MID($B30, BU31+1,2)=\"LJ\",MID($B30, BU31+1,2)=\"DŽ\"),BU31+2,BU31+1)","v":70}]

{"sheet":"igra","index":2,"n_rows":37,"n_cols":71,"rows_kept":37,"cut":false,"hidden":false,"merged":[[6,1,6,16],[16,8,16,9],[18,5,18,15],[19,1,19,4],[19,16,19,19]]}
[null,null,null,null,"P O G O D I   P O J A M"]
[null,null,null,"Tražimo",1,". ","zagonetni pojam (izjavu):"]
[]
[null,{"$f":"VLOOKUP($E$2,pojmovi!$D$2:$BV$30,B5+1)","v":"R"},{"$f":"VLOOKUP($E$2,pojmovi!$D$2:$BV$30,C5+1)","v":"u"},{"$f":"VLOOKUP($E$2,pojmovi!$D$2:$BV$30,D5+1)","v":"đ"},{"$f":"VLOOKUP($E$2,pojmovi!$D$2:$BV$30,E5+1)","v":"e"},{"$f":"VLOOKUP($E$2,pojmovi!$D$2:$BV$30,F5+1)","v":"r"},{"$f":"VLOOKUP($E$2,pojmovi!$D$2:$BV$30,G5+1)","v":" "},{"$f":"VLOOKUP($E$2,pojmovi!$D$2:$BV$30,H5+1)","v":"B"},{"$f":"VLOOKUP($E$2,pojmovi!$D$2:$BV$30,I5+1)","v":"o"},{"$f":"VLOOKUP($E$2,pojmovi!$D$2:$BV$30,J5+1)","v":"š"},{"$f":"VLOOKUP($E$2,pojmovi!$D$2:$BV$30,K5+1)","v":"k"},{"$f":"VLOOKUP($E$2,pojmovi!$D$2:$BV$30,L5+1)","v":"o"},{"$f":"VLOOKUP($E$2,pojmovi!$D$2:$BV$30,M5+1)","v":"v"},{"$f":"VLOOKUP($E$2,pojmovi!$D$2:$BV$30,N5+1)","v":"i"},{"$f":"VLOOKUP($E$2,pojmovi!$D$2:$BV$30,O5+1)","v":"ć"},{"$f":"VLOOKUP($E$2,pojmovi!$D$2:$BV$30,P5+1)","v":""},{"$f":"VLOOKUP($E$2,pojmovi!$D$2:$BV$30,Q5+1)","v":""},{"$f":"VLOOKUP($E$2,pojmovi!$D$2:$BV$30,R5+1)","v":""},{"$f":"VLOOKUP($E$2,pojmovi!$D$2:$BV$30,S5+1)","v":""},{"$f":"VLOOKUP($E$2,pojmovi!$D$2:$BV$30,T5+1)","v":""},{"$f":"VLOOKUP($E$2,pojmovi!$D$2:$BV$30,U5+1)","v":""},{"$f":"VLOOKUP($E$2,pojmovi!$D$2:$BV$30,V5+1)","v":""},{"$f":"VLOOKUP($E$2,pojmovi!$D$2:$BV$30,W5+1)","v":""},{"$f":"VLOOKUP($E$2,pojmovi!$D$2:$BV$30,X5+1)","v":""},{"$f":"VLOOKUP($E$2,pojmovi!$D$2:$BV$30,Y5+1)","v":""},{"$f":"VLOOKUP($E$2,pojmovi!$D$2:$BV$30,Z5+1)","v":""},{"$f":"VLOOKUP($E$2,pojmovi!$D$2:$BV$30,AA5+1)","v":""},{"$f":"VLOOKUP($E$2,pojmovi!$D$2:$BV$30,AB5+1)","v":""},{"$f":"VLOOKUP($E$2,pojmovi!$D$2:$BV$30,AC5+1)","v":""},{"$f":"VLOOKUP($E$2,pojmovi!$D$2:$BV$30,AD5+1)","v":""},{"$f":"VLOOKUP($E$2,pojmovi!$D$2:$BV$30,AE5+1)","v":""},{"$f":"VLOOKUP($E$2,pojmovi!$D$2:$BV$30,AF5+1)","v":""},{"$f":"VLOOKUP($E$2,pojmovi!$D$2:$BV$30,AG5+1)","v":""},{"$f":"VLOOKUP($E$2,pojmovi!$D$2:$BV$30,AH5+1)","v":""},{"$f":"VLOOKUP($E$2,pojmovi!$D$2:$BV$30,AI5+1)","v":""},{"$f":"VLOOKUP($E$2,pojmovi!$D$2:$BV$30,AJ5+1)","v":""},{"$f":"VLOOKUP($E$2,pojmovi!$D$2:$BV$30,AK5+1)","v":""},{"$f":"VLOOKUP($E$2,pojmovi!$D$2:$BV$30,AL5+1)","v":""},{"$f":"VLOOKUP($E$2,pojmovi!$D$2:$BV$30,AM5+1)","v":""},{"$f":"VLOOKUP($E$2,pojmovi!$D$2:$BV$30,AN5+1)","v":""},{"$f":"VLOOKUP($E$2,pojmovi!$D$2:$BV$30,AO5+1)","v":""},{"$f":"VLOOKUP($E$2,pojmovi!$D$2:$BV$30,AP5+1)","v":""},{"$f":"VLOOKUP($E$2,pojmovi!$D$2:$BV$30,AQ5+1)","v":""},{"$f":"VLOOKUP($E$2,pojmovi!$D$2:$BV$30,AR5+1)","v":""},{"$f":"VLOOKUP($E$2,pojmovi!$D$2:$BV$30,AS5+1)","v":""},{"$f":"VLOOKUP($E$2,pojmovi!$D$2:$BV$30,AT5+1)","v":""},{"$f":"VLOOKUP($E$2,pojmovi!$D$2:$BV$30,AU5+1)","v":""},{"$f":"VLOOKUP($E$2,pojmovi!$D$2:$BV$30,AV5+1)","v":""},{"$f":"VLOOKUP($E$2,pojmovi!$D$2:$BV$30,AW5+1)","v":""},{"$f":"VLOOKUP($E$2,pojmovi!$D$2:$BV$30,AX5+1)","v":""},{"$f":"VLOOKUP($E$2,pojmovi!$D$2:$BV$30,AY5+1)","v":""},{"$f":"VLOOKUP($E$2,pojmovi!$D$2:$BV$30,AZ5+1)","v":""},{"$f":"VLOOKUP($E$2,pojmovi!$D$2:$BV$30,BA5+1)","v":""},{"$f":"VLOOKUP($E$2,pojmovi!$D$2:$BV$30,BB5+1)","v":""},{"$f":"VLOOKUP($E$2,pojmovi!$D$2:$BV$30,BC5+1)","v":""},{"$f":"VLOOKUP($E$2,pojmovi!$D$2:$BV$30,BD5+1)","v":""},{"$f":"VLOOKUP($E$2,pojmovi!$D$2:$BV$30,BE5+1)","v":""},{"$f":"VLOOKUP($E$2,pojmovi!$D$2:$BV$30,BF5+1)","v":""},{"$f":"VLOOKUP($E$2,pojmovi!$D$2:$BV$30,BG5+1)","v":""},{"$f":"VLOOKUP($E$2,pojmovi!$D$2:$BV$30,BH5+1)","v":""},{"$f":"VLOOKUP($E$2,pojmovi!$D$2:$BV$30,BI5+1)","v":""},{"$f":"VLOOKUP($E$2,pojmovi!$D$2:$BV$30,BJ5+1)","v":""},{"$f":"VLOOKUP($E$2,pojmovi!$D$2:$BV$30,BK5+1)","v":""},{"$f":"VLOOKUP($E$2,pojmovi!$D$2:$BV$30,BL5+1)","v":""},{"$f":"VLOOKUP($E$2,pojmovi!$D$2:$BV$30,BM5+1)","v":""},{"$f":"VLOOKUP($E$2,pojmovi!$D$2:$BV$30,BN5+1)","v":""},{"$f":"VLOOKUP($E$2,pojmovi!$D$2:$BV$30,BO5+1)","v":""},{"$f":"VLOOKUP($E$2,pojmovi!$D$2:$BV$30,BP5+1)","v":""},{"$f":"VLOOKUP($E$2,pojmovi!$D$2:$BV$30,BQ5+1)","v":""},{"$f":"VLOOKUP($E$2,pojmovi!$D$2:$BV$30,BR5+1)","v":""},{"$f":"VLOOKUP($E$2,pojmovi!$D$2:$BV$30,BS5+1)","v":""}]
[null,1,2,3,4,5,6,7,8,9,10,11,12,13,14,15,16,17,18,19,20,21,22,23,24,25,26,27,28,29,30,31,32,33,34,35,36,37,38,39,40,41,42,43,44,45,46,47,48,49,50,51,52,53,54,55,56,57,58,59,60,61,62,63,64,65,66,67,68,69,70]
[null,{"$f":"IF(B4=\"\",\"\",IF(B4=\" \",\"   \",IF(OR(B4=\".\",B4=\",\", B4=\"!\", B4=\"?\", B4=\";\",B4=\"-\",B4=\":\"), B4, IF(COUNTIF($B$10:$Q$14,B$4)>0,B$4,\"_\"))))","v":"_"},{"$f":"IF(C4=\"\",\"\",IF(C4=\" \",\"   \",IF(OR(C4=\".\",C4=\",\", C4=\"!\", C4=\"?\", C4=\";\",C4=\"-\",C4=\":\"), C4, IF(COUNTIF($B$10:$Q$14,C$4)>0,C$4,\"_\"))))","v":"_"},"_","_","_","   ","_","_","_","_","_","_","_","_","","","","","","","","","","","","","","","","","","","","","","","","","","","","","","","","","","","","","","","","","","","","","","","","","","","",{"$f":"IF(BO4=\"\",\"\",IF(BO4=\" \",\"   \",IF(OR(BO4=\".\",BO4=\",\", BO4=\"!\", BO4=\"?\", BO4=\";\",BO4=\"-\",BO4=\":\"), BO4, IF(COUNTIF($B$10:$Q$14,BO$4)>0,BO$4,\"_\"))))","v":""},"","","",""]
[null,{"$f":"B6&C6&D6&E6&F6&G6&H6&I6&J6&K6&L6&M6&N6&O6&P6&Q6&R6&S6&T6&U6&V6&W6&X6&Y6&Z6&AA6&AB6&AC6&AD6&AE6&AF6&AG6&AH6&AI6&AJ6&AK6&AL6&AM6&AN6&AO6&AP6&AQ6&AR6&AS6&AT6&AU6&AV6&AW6&AX6&AY6&AZ6&BA6&BB6&BC6&BD6&BE6&BF6&BG6&BH6&BI6&BJ6&BK6&BL6&BM6&BN6&BO6&BP6&BQ6&BR6&BS6","v":"_____   ________"}]
[]
[null,"=>  OTKRIVAMO SLOVA:",null,null,null,{"$f":"80-COUNTBLANK(B10:Q14)","v":0}]
[]
[]
[]
[]
[]
[]
[]
[]
[]
[]
[]
[]
[null,null,null,null,"za izbornik:"]
[null,null,null,null,1]
[null,null,null,null,2]
[null,null,null,null,3]
[null,null,null,null,4]
[null,null,null,null,5]
[null,null,null,null,6]
[null,null,null,null,7]
[null,null,null,null,8]
[null,null,null,null,9]
[null,null,null,null,10]
[null,null,null,null,11]
[null,null,null,null,12]
[null,null,null,null,13]
[null,null,null,null,14]
[null,null,null,null,15]