{"text_format":"1","workbook":"xlsx","n_sheets":3,"sheets":["o igri","pojmovi","igra"],"not_rendered":{"charts":0,"images":2,"macros":1,"external_links":0,"defined_names":1,"comments":1,"pivot_tables":0},"unopened":[],"bounds":{"document_bytes":16777216,"sheet_cells":100000,"rows_first":2000,"rows_last":500,"rows_between":2000,"halvings":0,"cell_chars":16384,"cell_head_chars":4096},"cells_cut":0,"cells_raw":0,"read":"whole","date_system":"1900"}

{"sheet":"o igri","index":0,"n_rows":28,"n_cols":11,"rows_kept":28,"cut":false,"hidden":false,"merged":[]}
[]
[null,"IGRA"]
[null,"Pogađalica"]
[null,null,null,null,null,null,null,null,null,null,"6.12.2018."]
[]
[null,"Priprema:"]
[null,"Na kartici (listi) \"pojmovi\" upisujete pojmove ili izjave koje će se u igri tražiti."]
[null,"Jedan pojam ili izjava ne smije imati više od 70 znakova (s prazninama). Možete koristiti i brojeve i interpunkcijske znakove."]
{"$rows_left_out":21}
{"sheet":"pojmovi","index":1,"n_rows":31,"n_cols":74,"rows_kept":31,"cut":false,"hidden":false,"merged":[]}
["r. br.","Zagonetni pojmovi i izjave: (Do 70 znakova s prazninama!)","znakova:",null,"izjava po slovima:"]
[1,"Ruđer Bošković",{"$f":"IF(LEN(B2)<71, LEN(B2),\"Previše!\")","v":14},1,{"$f":"IF(OR(LEFT(B2, 2) =\"NJ\", LEFT(B2, 2) =\"LJ\", LEFT(B2, 2) =\"DŽ\"), LEFT(B2, 2), LEFT(B2, 1))","v":"R"},{"$f":"IF(OR(MID($B$2, E$3+1,2) =\"NJ\", MID($B$2, E$3+1,2) =\"LJ\", MID($B$2, E$3+1,2) =\"DŽ\"), MID($B$2, E$3+1,2),MID($B$2, E$3+1,1))","v":"u"},{"$f":"IF(OR(MID($B$2, F$3+1,2) =\"NJ\", MID($B$2, F$3+1,2) =\"LJ\", MID($B$2, F$3+1,2) =\"DŽ\"), MID($B$2, F$3+1,2),MID($B$2, F$3+1,1))","v":"đ"},"e","r"," ","B","o","š","k","o","v","i","ć","","","","","","","","","","","","","","","","","","","","","","","","","","","","","","","","","","","","","","","","","","","","","","","","","","","","",{"$f":"IF(OR(MID($B$2, BR$3+1,2) =\"NJ\", MID($B$2, BR$3+1,2) =\"LJ\", MID($B$2, BR$3+1,2) =\"DŽ\"), MID($B$2, BR$3+1,2),MID($B$2, BR$3+1,1))","v":""},"","",""]
[null,null,null,null,{"$f":"IF(OR(LEFT(B2, 2) =\"NJ\", LEFT(B2, 2) =\"LJ\", LEFT(B2, 2) =\"DŽ\"),2,1)","v":1},{"$f":"IF(OR(MID($B$2,E$3+1,2)=\"NJ\",MID($B$2,E$3+1,2)=\"LJ\",MID($B$2,E$3+1,2)=\"DŽ\"),E$3+2,E$3+1)","v":2},3,4,5,6,{"$f":"IF(OR(MID($B$2,J$3+1,2)=\"NJ\",MID($B$2,J$3+1,2)=\"LJ\",MID($B$2,J$3+1,2)=\"DŽ\"),J$3+2,J$3+1)","v":7},{"$f":"IF(OR(MID($B$2,K$3+1,2)=\"NJ\",MID($B$2,K$3+1,2)=\"LJ\",MID($B$2,K$3+1,2)=\"DŽ\"),K$3+2,K$3+1)","v":8},9,10,11,12,13,14,15,16,17,18,19,20,21,22,23,24,25,26,27,28,29,30,31,32,33,34,35,36,37,38,39,40,41,42,43,44,45,46,47,48,49,50,51,52,53,54,55,56,57,58,59,60,61,62,63,64,65,66,67,68,69,70]
[2,"U radu je spas.",{"$f":"IF(LEN(B4)<71, LEN(B4),\"Previše!\")","v":15},2,{"$f":"IF(OR(LEFT(B4, 2) =\"NJ\", LEFT(B4, 2) =\"LJ\", LEFT(B4, 2) =\"DŽ\"), LEFT(B4, 2), LEFT(B4, 1))","v":"U"},{"$f":"IF(OR(MID($B4, E5+1,2) =\"NJ\", MID($B4, E5+1,2) =\"LJ\", MID($B4, E5+1,2) =\"DŽ\"), MID($B4, E5+1,2),MID($B4, E5+1,1))","v":" "},{"$f":"IF(OR(MID($B4, F5+1,2) =\"NJ\", MID($B4, F5+1,2) =\"LJ\", MID($B4, F5+1,2) =\"DŽ\"), MID($B4, F5+1,2),MID($B4, F5+1,1))","v":"r"},"a","d","u"," ","j","e"," ","s","p","a","s",".","","","","","","","","","","","","","","","","","","","","","","","","","","","","","","","","","","","","","","","","","","","","","","","","","","","",{"$f":"IF(OR(MID($B4, BR5+1,2) =\"NJ\", MID($B4, BR5+1,2) =\"LJ\", MID($B4, BR5+1,2) =\"DŽ\"), MID($B4, BR5+1,2),MID($B4, BR5+1,1))","v":""},"","",""]
[null,null,null,null,{"$f":"IF(OR(LEFT(B4, 2) =\"NJ\", LEFT(B4, 2) =\"LJ\", LEFT(B4, 2) =\"DŽ\"),2,1)","v":1},{"$f":"IF(OR(MID($B4, E5+1,2)=\"NJ\",MID($B4, E5+1,2)=\"LJ\",MID($B4, E5+1,2)=\"DŽ\"),E5+2,E5+1)","v":2},{"$f":"IF(OR(MID($B4, F5+1,2)=\"NJ\",MID($B4, F5+1,2)=\"LJ\",MID($B4, F5+1,2)=\"DŽ\"),F5+2,F5+1)","v":3},4,5,6,7,8,9,10,11,12,13,14,15,16,17,18,19,20,21,22,23,24,25,26,27,28,29,30,31,32,33,34,35,36,37,38,39,40,41,42,43,44,45,46,47,48,49,50,51,52,53,54,55,56,57,58,59,60,61,62,63,64,65,66,{"$f":"IF(OR(MID($B4, BR5+1,2)=\"NJ\",MID($B4, BR5+1,2)=\"LJ\",MID($B4, BR5+1,2)=\"DŽ\"),BR5+2,BR5+1)","v":67},68,69,70]
[3,"Sada je 2018. godina.",21,3,{"$f":"IF(OR(LEFT(B6, 2) =\"NJ\", LEFT(B6, 2) =\"LJ\", LEFT(B6, 2) =\"DŽ\"), LEFT(B6, 2), LEFT(B6, 1))","v":"S"},{"$f":"IF(OR(MID($B6, E7+1,2) =\"NJ\", MID($B6, E7+1,2) =\"LJ\", MID($B6, E7+1,2) =\"DŽ\"), MID($B6, E7+1,2),MID($B6, E7+1,1))","v":"a"},"d","a"," ","j","e"," ","2","0","1","8","."," ","g","o","d","i","n","a",".","","","","","","","","","","","","","","","","","","","","","","","","","","","","","","","","","","","","","","","","","","","","","","","","",""]
[null,null,null,null,{"$f":"IF(OR(LEFT(B6, 2) =\"NJ\", LEFT(B6, 2) =\"LJ\", LEFT(B6, 2) =\"DŽ\"),2,1)","v":1},{"$f":"IF(OR(MID($B6, E7+1,2)=\"NJ\",MID($B6, E7+1,2)=\"LJ\",MID($B6, E7+1,2)=\"DŽ\"),E7+2,E7+1)","v":2},{"$f":"IF(OR(MID($B6, F7+1,2)=\"NJ\",MID($B6, F7+1,2)=\"LJ\",MID($B6, F7+1,2)=\"DŽ\"),F7+2,F7+1)","v":3},{"$f":"IF(OR(MID($B6, G7+1,2)=\"NJ\",MID($B6, G7+1,2)=\"LJ\",MID($B6, G7+1,2)=\"DŽ\"),G7+2,G7+1)","v":4},{"$f":"IF(OR(MID($B6, H7+1,2)=\"NJ\",MID($B6, H7+1,2)=\"LJ\",MID($B6, H7+1,2)=\"DŽ\"),H7+2,H7+1)","v":5},{"$f":"IF(OR(MID($B6, I7+1,2)=\"NJ\",MID($B6, I7+1,2)=\"LJ\",MID($B6, I7+1,2)=\"DŽ\"),I7+2,I7+1)","v":6},{"$f":"IF(OR(MID($B6, J7+1,2)=\"NJ\",MID($B6, J7+1,2)=\"LJ\",MID($B6, J7+1,2)=\"DŽ\"),J7+2,J7+1)","v":7},{"$f":"IF(OR(MID($B6, K7+1,2)=\"NJ\",MID($B6, K7+1,2)=\"LJ\",MID($B6, K7+1,2)=\"DŽ\"),K7+2,K7+1)","v":8},{"$f":"IF(OR(MID($B6, L7+1,2)=\"NJ\",MID($B6, L7+1,2)=\"LJ\",MID($B6, L7+1,2)=\"DŽ\"),L7+2,L7+1)","v":9},{"$f":"IF(OR(MID($B6, M7+1,2)=\"NJ\",MID($B6, M7+1,2)=\"LJ\",MID($B6, M7+1,2)=\"DŽ\"),M7+2,M7+1)","v":10},{"$f":"IF(OR(MID($B6, N7+1,2)=\"NJ\",MID($B6, N7+1,2)=\"LJ\",MID($B6, N7+1,2)=\"DŽ\"),N7+2,N7+1)","v":11},{"$f":"IF(OR(MID($B6, O7+1,2)=\"NJ\",MID($B6, O7+1,2)=\"LJ\",MID($B6, O7+1,2)=\"DŽ\"),O7+2,O7+1)","v":12},{"$f":"IF(OR(MID($B6, P7+1,2)=\"NJ\",MID($B6, P7+1,2)=\"LJ\",MID($B6, P7+1,2)=\"DŽ\"),P7+2,P7+1)","v":13},{"$f":"IF(OR(MID($B6, Q7+1,2)=\"NJ\",MID($B6, Q7+1,2)=\"LJ\",MID($B6, Q7+1,2)=\"DŽ\"),Q7+2,Q7+1)","v":14},{"$f":"IF(OR(MID($B6, R7+1,2)=\"NJ\",MID($B6, R7+1,2)=\"LJ\",MID($B6, R7+1,2)=\"DŽ\"),R7+2,R7+1)","v":15},{"$f":"IF(OR(MID($B6, S7+1,2)=\"NJ\",MID($B6, S7+1,2)=\"LJ\",MID($B6, S7+1,2)=\"DŽ\"),S7+2,S7+1)","v":16},{"$f":"IF(OR(MID($B6, T7+1,2)=\"NJ\",MID($B6, T7+1,2)=\"LJ\",MID($B6, T7+1,2)=\"DŽ\"),T7+2,T7+1)","v":17},{"$f":"IF(OR(MID($B6, U7+1,2)=\"NJ\",MID($B6, U7+1,2)=\"LJ\",MID($B6, U7+1,2)=\"DŽ\"),U7+2,U7+1)","v":18},{"$f":"IF(OR(MID($B6, V7+1,2)=\"NJ\",MID($B6, V7+1,2)=\"LJ\",MID($B6, V7+1,2)=\"DŽ\"),V7+2,V7+1)","v":19},{"$f":"IF(OR(MID($B6, W7+1,2)=\"NJ\",MID($B6, W7+1,2)=\"LJ\",MID($B6, W7+1,2)=\"DŽ\"),W7+2,W7+1)","v":20},{"$f":"IF(OR(MID($B6, X7+1,2)=\"NJ\",MID($B6, X7+1,2)=\"LJ\",MID($B6, X7+1,2)=\"DŽ\"),X7+2,X7+1)","v":21},{"$f":"IF(OR(MID($B6, Y7+1,2)=\"NJ\",MID($B6, Y7+1,2)=\"LJ\",MID($B6, Y7+1,2)=\"DŽ\"),Y7+2,Y7+1)","v":22},{"$f":"IF(OR(MID($B6, Z7+1,2)=\"NJ\",MID($B6, Z7+1,2)=\"LJ\",MID($B6, Z7+1,2)=\"DŽ\"),Z7+2,Z7+1)","v":23},{"$f":"IF(OR(MID($B6, AA7+1,2)=\"NJ\",MID($B6, AA7+1,2)=\"LJ\",MID($B6, AA7+1,2)=\"DŽ\"),AA7+2,AA7+1)","v":24},{"$f":"IF(OR(MID($B6, AB7+1,2)=\"NJ\",MID($B6, AB7+1,2)=\"LJ\",MID($B6, AB7+1,2)=\"DŽ\"),AB7+2,AB7+1)","v":25},{"$f":"IF(OR(MID($B6, AC7+1,2)=\"NJ\",MID($B6, AC7+1,2)=\"LJ\",MID($B6, AC7+1,2)=\"DŽ\"),AC7+2,AC7+1)","v":26},{"$f":"IF(OR(MID($B6, AD7+1,2)=\"NJ\",MID($B6, AD7+1,2)=\"LJ\",MID($B6, AD7+1,2)=\"DŽ\"),AD7+2,AD7+1)","v":27},{"$f":"IF(OR(MID($B6, AE7+1,2)=\"NJ\",MID($B6, AE7+1,2)=\"LJ\",MID($B6, AE7+1,2)=\"DŽ\"),AE7+2,AE7+1)","v":28},{"$f":"IF(OR(MID($B6, AF7+1,2)=\"NJ\",MID($B6, AF7+1,2)=\"LJ\",MID($B6, AF7+1,2)=\"DŽ\"),AF7+2,AF7+1)","v":29},{"$f":"IF(OR(MID($B6, AG7+1,2)=\"NJ\",MID($B6, AG7+1,2)=\"LJ\",MID($B6, AG7+1,2)=\"DŽ\"),AG7+2,AG7+1)","v":30},{"$f":"IF(OR(MID($B6, AH7+1,2)=\"NJ\",MID($B6, AH7+1,2)=\"LJ\",MID($B6, AH7+1,2)=\"DŽ\"),AH7+2,AH7+1)","v":31},{"$f":"IF(OR(MID($B6, AI7+1,2)=\"NJ\",MID($B6, AI7+1,2)=\"LJ\",MID($B6, AI7+1,2)=\"DŽ\"),AI7+2,AI7+1)","v":32},{"$f":"IF(OR(MID($B6, AJ7+1,2)=\"NJ\",MID($B6, AJ7+1,2)=\"LJ\",MID($B6, AJ7+1,2)=\"DŽ\"),AJ7+2,AJ7+1)","v":33},{"$f":"IF(OR(MID($B6, AK7+1,2)=\"NJ\",MID($B6, AK7+1,2)=\"LJ\",MID($B6, AK7+1,2)=\"DŽ\"),AK7+2,AK7+1)","v":34},{"$f":"IF(OR(MID($B6, AL7+1,2)=\"NJ\",MID($B6, AL7+1,2)=\"LJ\",MID($B6, AL7+1,2)=\"DŽ\"),AL7+2,AL7+1)","v":35},{"$f":"IF(OR(MID($B6, AM7+1,2)=\"NJ\",MID($B6, AM7+1,2)=\"LJ\",MID($B6, AM7+1,2)=\"DŽ\"),AM7+2,AM7+1)","v":36},{"$f":"IF(OR(MID($B6, AN7+1,2)=\"NJ\",MID($B6, AN7+1,2)=\"LJ\",MID($B6, AN7+1,2)=\"DŽ\"),AN7+2,AN7+1)","v":37},{"$f":"IF(OR(MID($B6, AO7+1,2)=\"NJ\",MID($B6, AO7+1,2)=\"LJ\",MID($B6, AO7+1,2)=\"DŽ\"),AO7+2,AO7+1)","v":38},{"$f":"IF(OR(MID($B6, AP7+1,2)=\"NJ\",MID($B6, AP7+1,2)=\"LJ\",MID($B6, AP7+1,2)=\"DŽ\"),AP7+2,AP7+1)","v":39},{"$f":"IF(OR(MID($B6, AQ7+1,2)=\"NJ\",MID($B6, AQ7+1,2)=\"LJ\",MID($B6, AQ7+1,2)=\"DŽ\"),AQ7+2,AQ7+1)","v":40},{"$f":"IF(OR(MID($B6, AR7+1,2)=\"NJ\",MID($B6, AR7+1,2)=\"LJ\",MID($B6, AR7+1,2)=\"DŽ\"),AR7+2,AR7+1)","v":41},{"$f":"IF(OR(MID($B6, AS7+1,2)=\"NJ\",MID($B6, AS7+1,2)=\"LJ\",MID($B6, AS7+1,2)=\"DŽ\"),AS7+2,AS7+1)","v":42},{"$f":"IF(OR(MID($B6, AT7+1,2)=\"NJ\",MID($B6, AT7+1,2)=\"LJ\",MID($B6, AT7+1,2)=\"DŽ\"),AT7+2,AT7+1)","v":43},{"$f":"IF(OR(MID($B6, AU7+1,2)=\"NJ\",MID($B6, AU7+1,2)=\"LJ\",MID($B6, AU7+1,2)=\"DŽ\"),AU7+2,AU7+1)","v":44},{"$f":"IF(OR(MID($B6, AV7+1,2)=\"NJ\",MID($B6, AV7+1,2)=\"LJ\",MID($B6, AV7+1,2)=\"DŽ\"),AV7+2,AV7+1)","v":45},{"$f":"IF(OR(MID($B6, AW7+1,2)=\"NJ\",MID($B6, AW7+1,2)=\"LJ\",MID($B6, AW7+1,2)=\"DŽ\"),AW7+2,AW7+1)","v":46},{"$f":"IF(OR(MID($B6, AX7+1,2)=\"NJ\",MID($B6, AX7+1,2)=\"LJ\",MID($B6, AX7+1,2)=\"DŽ\"),AX7+2,AX7+1)","v":47},{"$f":"IF(OR(MID($B6, AY7+1,2)=\"NJ\",MID($B6, AY7+1,2)=\"LJ\",MID($B6, AY7+1,2)=\"DŽ\"),AY7+2,AY7+1)","v":48},{"$f":"IF(OR(MID($B6, AZ7+1,2)=\"NJ\",MID($B6, AZ7+1,2)=\"LJ\",MID($B6, AZ7+1,2)=\"DŽ\"),AZ7+2,AZ7+1)","v":49},{"$f":"IF(OR(MID($B6, BA7+1,2)=\"NJ\",MID($B6, BA7+1,2)=\"LJ\",MID($B6, BA7+1,2)=\"DŽ\"),BA7+2,BA7+1)","v":50},{"$f":"IF(OR(MID($B6, BB7+1,2)=\"NJ\",MID($B6, BB7+1,2)=\"LJ\",MID($B6, BB7+1,2)=\"DŽ\"),BB7+2,BB7+1)","v":51},{"$f":"IF(OR(MID($B6, BC7+1,2)=\"NJ\",MID($B6, BC7+1,2)=\"LJ\",MID($B6, BC7+1,2)=\"DŽ\"),BC7+2,BC7+1)","v":52},{"$f":"IF(OR(MID($B6, BD7+1,2)=\"NJ\",MID($B6, BD7+1,2)=\"LJ\",MID($B6, BD7+1,2)=\"DŽ\"),BD7+2,BD7+1)","v":53},{"$f":"IF(OR(MID($B6, BE7+1,2)=\"NJ\",MID($B6, BE7+1,2)=\"LJ\",MID($B6, BE7+1,2)=\"DŽ\"),BE7+2,BE7+1)","v":54},{"$f":"IF(OR(MID($B6, BF7+1,2)=\"NJ\",MID($B6, BF7+1,2)=\"LJ\",MID($B6, BF7+1,2)=\"DŽ\"),BF7+2,BF7+1)","v":55},{"$f":"IF(OR(MID($B6, BG7+1,2)=\"NJ\",MID($B6, BG7+1,2)=\"LJ\",MID($B6, BG7+1,2)=\"DŽ\"),BG7+2,BG7+1)","v":56},{"$f":"IF(OR(MID($B6, BH7+1,2)=\"NJ\",MID($B6, BH7+1,2)=\"LJ\",MID($B6, BH7+1,2)=\"DŽ\"),BH7+2,BH7+1)","v":57},{"$f":"IF(OR(MID($B6, BI7+1,2)=\"NJ\",MID($B6, BI7+1,2)=\"LJ\",MID($B6, BI7+1,2)=\"DŽ\"),BI7+2,BI7+1)","v":58},{"$f":"IF(OR(MID($B6, BJ7+1,2)=\"NJ\",MID($B6, BJ7+1,2)=\"LJ\",MID($B6, BJ7+1,2)=\"DŽ\"),BJ7+2,BJ7+1)","v":59},{"$f":"IF(OR(MID($B6, BK7+1,2)=\"NJ\",MID($B6, BK7+1,2)=\"LJ\",MID($B6, BK7+1,2)=\"DŽ\"),BK7+2,BK7+1)","v":60},{"$f":"IF(OR(MID($B6, BL7+1,2)=\"NJ\",MID($B6, BL7+1,2)=\"LJ\",MID($B6, BL7+1,2)=\"DŽ\"),BL7+2,BL7+1)","v":61},{"$f":"IF(OR(MID($B6, BM7+1,2)=\"NJ\",MID($B6, BM7+1,2)=\"LJ\",MID($B6, BM7+1,2)=\"DŽ\"),BM7+2,BM7+1)","v":62},{"$f":"IF(OR(MID($B6, BN7+1,2)=\"NJ\",MID($B6, BN7+1,2)=\"LJ\",MID($B6, BN7+1,2)=\"DŽ\"),BN7+2,BN7+1)","v":63},{"$f":"IF(OR(MID($B6, BO7+1,2)=\"NJ\",MID($B6, BO7+1,2)=\"LJ\",MID($B6, BO7+1,2)=\"DŽ\"),BO7+2,BO7+1)","v":64},{"$f":"IF(OR(MID($B6, BP7+1,2)=\"NJ\",MID($B6, BP7+1,2)=\"LJ\",MID($B6, BP7+1,2)=\"DŽ\"),BP7+2,BP7+1)","v":65},{"$f":"IF(OR(MID($B6, BQ7+1,2)=\"NJ\",MID($B6, BQ7+1,2)=\"LJ\",MID($B6, BQ7+1,2)=\"DŽ\"),BQ7+2,BQ7+1)","v":66},{"$f":"IF(OR(MID($B6, BR7+1,2)=\"NJ\",MID($B6, BR7+1,2)=\"LJ\",MID($B6, BR7+1,2)=\"DŽ\"),BR7+2,BR7+1)","v":67},{"$f":"IF(OR(MID($B6, BS7+1,2)=\"NJ\",MID($B6, BS7+1,2)=\"LJ\",MID($B6, BS7+1,2)=\"DŽ\"),BS7+2,BS7+1)","v":68},{"$f":"IF(OR(MID($B6, BT7+1,2)=\"NJ\",MID($B6, BT7+1,2)=\"LJ\",MID($B6, BT7+1,2)=\"DŽ\"),BT7+2,BT7+1)","v":69},{"$f":"IF(OR(MID($B6, BU7+1,2)=\"NJ\",MID($B6, BU7+1,2)=\"LJ\",MID($B6, BU7+1,2)=\"DŽ\"),BU7+2,BU7+1)","v":70}]
[4,"Ovo je primjer neke izjave.",27,4,{"$f":"IF(OR(LEFT(B8, 2) =\"NJ\", LEFT(B8, 2) =\"LJ\", LEFT(B8, 2) =\"DŽ\"), LEFT(B8, 2), LEFT(B8, 1))","v":"O"},{"$f":"IF(OR(MID($B8, E9+1,2) =\"NJ\", MID($B8, E9+1,2) =\"LJ\", MID($B8, E9+1,2) =\"DŽ\"), MID($B8, E9+1,2),MID($B8, E9+1,1))","v":"v"},"o"," ","j","e"," ","p","r","i","m","j","e","r"," ","n","e","k","e"," ","i","z","j","a","v","e",".","","","","","","","","","","","","","","","","","","","","","","","","","","","","","","","","","","","","","","","","","","",""]
{"$rows_left_out":24}
{"sheet":"igra","index":2,"n_rows":37,"n_cols":71,"rows_kept":37,"cut":false,"hidden":false,"merged":[[6,1,6,16],[16,8,16,9],[18,5,18,15],[19,1,19,4],[19,16,19,19]]}
[null,null,null,null,"P O G O D I   P O J A M"]
[null,null,null,"Tražimo",1,". ","zagonetni pojam (izjavu):"]
[]
[null,{"$f":"VLOOKUP($E$2,pojmovi!$D$2:$BV$30,B5+1)","v":"R"},{"$f":"VLOOKUP($E$2,pojmovi!$D$2:$BV$30,C5+1)","v":"u"},{"$f":"VLOOKUP($E$2,pojmovi!$D$2:$BV$30,D5+1)","v":"đ"},{"$f":"VLOOKUP($E$2,pojmovi!$D$2:$BV$30,E5+1)","v":"e"},{"$f":"VLOOKUP($E$2,pojmovi!$D$2:$BV$30,F5+1)","v":"r"},{"$f":"VLOOKUP($E$2,pojmovi!$D$2:$BV$30,G5+1)","v":" "},{"$f":"VLOOKUP($E$2,pojmovi!$D$2:$BV$30,H5+1)","v":"B"},{"$f":"VLOOKUP($E$2,pojmovi!$D$2:$BV$30,I5+1)","v":"o"},{"$f":"VLOOKUP($E$2,pojmovi!$D$2:$BV$30,J5+1)","v":"š"},{"$f":"VLOOKUP($E$2,pojmovi!$D$2:$BV$30,K5+1)","v":"k"},{"$f":"VLOOKUP($E$2,pojmovi!$D$2:$BV$30,L5+1)","v":"o"},{"$f":"VLOOKUP($E$2,pojmovi!$D$2:$BV$30,M5+1)","v":"v"},{"$f":"VLOOKUP($E$2,pojmovi!$D$2:$BV$30,N5+1)","v":"i"},{"$f":"VLOOKUP($E$2,pojmovi!$D$2:$BV$30,O5+1)","v":"ć"},{"$f":"VLOOKUP($E$2,pojmovi!$D$2:$BV$30,P5+1)","v":""},{"$f":"VLOOKUP($E$2,pojmovi!$D$2:$BV$30,Q5+1)","v":""},{"$f":"VLOOKUP($E$2,pojmovi!$D$2:$BV$30,R5+1)","v":""},{"$f":"VLOOKUP($E$2,pojmovi!$D$2:$BV$30,S5+1)","v":""},{"$f":"VLOOKUP($E$2,pojmovi!$D$2:$BV$30,T5+1)","v":""},{"$f":"VLOOKUP($E$2,pojmovi!$D$2:$BV$30,U5+1)","v":""},{"$f":"VLOOKUP($E$2,pojmovi!$D$2:$BV$30,V5+1)","v":""},{"$f":"VLOOKUP($E$2,pojmovi!$D$2:$BV$30,W5+1)","v":""},{"$f":"VLOOKUP($E$2,pojmovi!$D$2:$BV$30,X5+1)","v":""},{"$f":"VLOOKUP($E$2,pojmovi!$D$2:$BV$30,Y5+1)","v":""},{"$f":"VLOOKUP($E$2,pojmovi!$D$2:$BV$30,Z5+1)","v":""},{"$f":"VLOOKUP($E$2,pojmovi!$D$2:$BV$30,AA5+1)","v":""},{"$f":"VLOOKUP($E$2,pojmovi!$D$2:$BV$30,AB5+1)","v":""},{"$f":"VLOOKUP($E$2,pojmovi!$D$2:$BV$30,AC5+1)","v":""},{"$f":"VLOOKUP($E$2,pojmovi!$D$2:$BV$30,AD5+1)","v":""},{"$f":"VLOOKUP($E$2,pojmovi!$D$2:$BV$30,AE5+1)","v":""},{"$f":"VLOOKUP($E$2,pojmovi!$D$2:$BV$30,AF5+1)","v":""},{"$f":"VLOOKUP($E$2,pojmovi!$D$2:$BV$30,AG5+1)","v":""},{"$f":"VLOOKUP($E$2,pojmovi!$D$2:$BV$30,AH5+1)","v":""},{"$f":"VLOOKUP($E$2,pojmovi!$D$2:$BV$30,AI5+1)","v":""},{"$f":"VLOOKUP($E$2,pojmovi!$D$2:$BV$30,AJ5+1)","v":""},{"$f":"VLOOKUP($E$2,pojmovi!$D$2:$BV$30,AK5+1)","v":""},{"$f":"VLOOKUP($E$2,pojmovi!$D$2:$BV$30,AL5+1)","v":""},{"$f":"VLOOKUP($E$2,pojmovi!$D$2:$BV$30,AM5+1)","v":""},{"$f":"VLOOKUP($E$2,pojmovi!$D$2:$BV$30,AN5+1)","v":""},{"$f":"VLOOKUP($E$2,pojmovi!$D$2:$BV$30,AO5+1)","v":""},{"$f":"VLOOKUP($E$2,pojmovi!$D$2:$BV$30,AP5+1)","v":""},{"$f":"VLOOKUP($E$2,pojmovi!$D$2:$BV$30,AQ5+1)","v":""},{"$f":"VLOOKUP($E$2,pojmovi!$D$2:$BV$30,AR5+1)","v":""},{"$f":"VLOOKUP($E$2,pojmovi!$D$2:$BV$30,AS5+1)","v":""},{"$f":"VLOOKUP($E$2,pojmovi!$D$2:$BV$30,AT5+1)","v":""},{"$f":"VLOOKUP($E$2,pojmovi!$D$2:$BV$30,AU5+1)","v":""},{"$f":"VLOOKUP($E$2,pojmovi!$D$2:$BV$30,AV5+1)","v":""},{"$f":"VLOOKUP($E$2,pojmovi!$D$2:$BV$30,AW5+1)","v":""},{"$f":"VLOOKUP($E$2,pojmovi!$D$2:$BV$30,AX5+1)","v":""},{"$f":"VLOOKUP($E$2,pojmovi!$D$2:$BV$30,AY5+1)","v":""},{"$f":"VLOOKUP($E$2,pojmovi!$D$2:$BV$30,AZ5+1)","v":""},{"$f":"VLOOKUP($E$2,pojmovi!$D$2:$BV$30,BA5+1)","v":""},{"$f":"VLOOKUP($E$2,pojmovi!$D$2:$BV$30,BB5+1)","v":""},{"$f":"VLOOKUP($E$2,pojmovi!$D$2:$BV$30,BC5+1)","v":""},{"$f":"VLOOKUP($E$2,pojmovi!$D$2:$BV$30,BD5+1)","v":""},{"$f":"VLOOKUP($E$2,pojmovi!$D$2:$BV$30,BE5+1)","v":""},{"$f":"VLOOKUP($E$2,pojmovi!$D$2:$BV$30,BF5+1)","v":""},{"$f":"VLOOKUP($E$2,pojmovi!$D$2:$BV$30,BG5+1)","v":""},{"$f":"VLOOKUP($E$2,pojmovi!$D$2:$BV$30,BH5+1)","v":""},{"$f":"VLOOKUP($E$2,pojmovi!$D$2:$BV$30,BI5+1)","v":""},{"$f":"VLOOKUP($E$2,pojmovi!$D$2:$BV$30,BJ5+1)","v":""},{"$f":"VLOOKUP($E$2,pojmovi!$D$2:$BV$30,BK5+1)","v":""},{"$f":"VLOOKUP($E$2,pojmovi!$D$2:$BV$30,BL5+1)","v":""},{"$f":"VLOOKUP($E$2,pojmovi!$D$2:$BV$30,BM5+1)","v":""},{"$f":"VLOOKUP($E$2,pojmovi!$D$2:$BV$30,BN5+1)","v":""},{"$f":"VLOOKUP($E$2,pojmovi!$D$2:$BV$30,BO5+1)","v":""},{"$f":"VLOOKUP($E$2,pojmovi!$D$2:$BV$30,BP5+1)","v":""},{"$f":"VLOOKUP($E$2,pojmovi!$D$2:$BV$30,BQ5+1)","v":""},{"$f":"VLOOKUP($E$2,pojmovi!$D$2:$BV$30,BR5+1)","v":""},{"$f":"VLOOKUP($E$2,pojmovi!$D$2:$BV$30,BS5+1)","v":""}]
[null,1,2,3,4,5,6,7,8,9,10,11,12,13,14,15,16,17,18,19,20,21,22,23,24,25,26,27,28,29,30,31,32,33,34,35,36,37,38,39,40,41,42,43,44,45,46,47,48,49,50,51,52,53,54,55,56,57,58,59,60,61,62,63,64,65,66,67,68,69,70]
[null,{"$f":"IF(B4=\"\",\"\",IF(B4=\" \",\"   \",IF(OR(B4=\".\",B4=\",\", B4=\"!\", B4=\"?\", B4=\";\",B4=\"-\",B4=\":\"), B4, IF(COUNTIF($B$10:$Q$14,B$4)>0,B$4,\"_\"))))","v":"_"},{"$f":"IF(C4=\"\",\"\",IF(C4=\" \",\"   \",IF(OR(C4=\".\",C4=\",\", C4=\"!\", C4=\"?\", C4=\";\",C4=\"-\",C4=\":\"), C4, IF(COUNTIF($B$10:$Q$14,C$4)>0,C$4,\"_\"))))","v":"_"},"_","_","_","   ","_","_","_","_","_","_","_","_","","","","","","","","","","","","","","","","","","","","","","","","","","","","","","","","","","","","","","","","","","","","","","","","","","","",{"$f":"IF(BO4=\"\",\"\",IF(BO4=\" \",\"   \",IF(OR(BO4=\".\",BO4=\",\", BO4=\"!\", BO4=\"?\", BO4=\";\",BO4=\"-\",BO4=\":\"), BO4, IF(COUNTIF($B$10:$Q$14,BO$4)>0,BO$4,\"_\"))))","v":""},"","","",""]
[null,{"$f":"B6&C6&D6&E6&F6&G6&H6&I6&J6&K6&L6&M6&N6&O6&P6&Q6&R6&S6&T6&U6&V6&W6&X6&Y6&Z6&AA6&AB6&AC6&AD6&AE6&AF6&AG6&AH6&AI6&AJ6&AK6&AL6&AM6&AN6&AO6&AP6&AQ6&AR6&AS6&AT6&AU6&AV6&AW6&AX6&AY6&AZ6&BA6&BB6&BC6&BD6&BE6&BF6&BG6&BH6&BI6&BJ6&BK6&BL6&BM6&BN6&BO6&BP6&BQ6&BR6&BS6","v":"_____   ________"}]
[]
{"$rows_left_out":29}